Decanedioic acid, dimethyl ester
- Formula: C12H22O4
- Molecular weight: 230.3007
- IUPAC Standard InChIKey: ALOUNLDAKADEEB-UHFFFAOYSA-N
- CAS Registry Number: 106-79-6
- Chemical structure:
View 3d structure (requires JavaScript / HTML 5) - Other names: Sebacic acid, dimethyl ester; Dimethyl decanedioate; Dimethyl octane-1,8-dicarboxylate; Dimethyl sebacate; Methyl sebacate; decadioic acid, dimethyl ester; Decanedioic acid, methyl ester

Condensed phase thermochemistry data

Data compiled by: Hussein Y. Afeefy, Joel F. Liebman, and Stephen E. Stein
Quantity | Value | Units | Method | Reference | Comment |
---|---|---|---|---|---|
ΔcH°solid | -6844.2 | kJ/mol | Ccb | Verkade, Coops, et al., 1926 | Heat of combustion at 15°C; Corresponding ΔfHºsolid = -1022. kJ/mol (simple calculation by NIST; no Washburn corrections) |

Phase change data

Data compiled as indicated in comments:
BS - Robert L. Brown and Stephen E. Stein
TRC - Thermodynamics Research Center, NIST Boulder Laboratories, Chris Muzny director
AC - William E. Acree, Jr., James S. Chickos
Quantity | Value | Units | Method | Reference | Comment |
---|---|---|---|---|---|
Tfus | 301.2 | K | N/A | Cheshko and Shvaika, 1971 | Uncertainty assigned by TRC = 2. K; TRC |
Tfus | 299.95 | K | N/A | Trent, Miller, et al., 1960 | Uncertainty assigned by TRC = 0.5 K; TRC |
Tfus | 300.2 | K | N/A | Soffer, Strauss, et al., 1947 | Uncertainty assigned by TRC = 1.5 K; TRC |
Tfus | 299.6 | K | N/A | Houston and Furlow, 1946 | Uncertainty assigned by TRC = 2. K; TRC |
Tfus | 299.55 | K | N/A | Karvonen, 1929 | Uncertainty assigned by TRC = 0.5 K; TRC |
Quantity | Value | Units | Method | Reference | Comment |
ΔvapH° | 86.4 ± 0.3 | kJ/mol | GS | Verevkin, Kozlova, et al., 2006 | Based on data from 304. to 374. K.; AC |
Reduced pressure boiling point
Tboil (K) | Pressure (bar) | Reference | Comment |
---|---|---|---|
431.2 | 0.013 | Aldrich Chemical Company Inc., 1990 | BS |
448.2 | 0.027 | Weast and Grasselli, 1989 | BS |

Kovats' RI, non-polar column, isothermal

Column type | Active phase | Temperature (C) | I | Reference | Comment |
---|---|---|---|---|---|
Capillary | Ultra-1 | 125. | 1613. | Herrmann, Dufka, et al., 1986 | 25. m/0.20 mm/0.32 μm, N2 |
Capillary | Ultra-1 | 150. | 1613. | Herrmann, Dufka, et al., 1986 | 25. m/0.20 mm/0.32 μm, N2 |
Capillary | Ultra-1 | 175. | 1613. | Herrmann, Dufka, et al., 1986 | 25. m/0.20 mm/0.32 μm, N2 |
Capillary | Ultra-1 | 200. | 1614. | Herrmann, Dufka, et al., 1986 | 25. m/0.20 mm/0.32 μm, N2 |
Packed | SE-30 | 220. | 1646. | Zulaïca and Guiochon, 1963 | Column length: 2. m |

Kovats' RI, non-polar column, temperature ramp

Column type | Active phase | I | Reference | Comment |
---|---|---|---|---|
Packed | OV-101 | 1627. | Alley and Dykes, 1972 | 6. K/min; Tstart: 70. C; Tend: 220. C |

Kovats' RI, non-polar column, custom temperature program

Column type | Active phase | I | Reference | Comment |
---|---|---|---|---|
Packed | SE-30 | 1645. | Ramsey, Lee, et al., 1980 | He, Chromosorb G HP (80-100 mesh); Column length: 1.5 m; Program: not specified |

Van Den Dool and Kratz RI, non-polar column, temperature ramp

Column type | Active phase | I | Reference | Comment |
---|---|---|---|---|
Capillary | DB-1 | 1611. | Johnson, Urso, et al., 1997 | 30. m/0.2 mm/0.25 μm, 50. C @ 2. min, 5. K/min, 300. C @ 5. min |
Capillary | DB-1 | 1612. | Johnson, Urso, et al., 1997 | 30. m/0.2 mm/0.25 μm, 50. C @ 2. min, 5. K/min, 300. C @ 5. min |
Capillary | DB-1 | 1611. | Johnson, Urso, et al., 1997 | 30. m/0.2 mm/0.25 μm, 50. C @ 2. min, 5. K/min, 300. C @ 5. min |
Packed | SE-30 | 1619. | Helaimia and Messadi, 1989 | Chromosorb Q, 10. K/min; Column length: 2. m; Tstart: 100. C |
Packed | SE-30 | 1631. | Helaimia and Messadi, 1989 | Chromosorb Q, 10. K/min; Column length: 2. m; Tstart: 100. C |
Capillary | OV-1 | 1620. | Tan, Holland, et al., 1988 | He, 8. K/min, 280. C @ 10. min; Column length: 25. m; Column diameter: 0.32 mm; Tstart: 40. C |
Capillary | DB-5 | 1649. | Rostad and Pereira, 1986 | 30. m/0.26 mm/0.25 μm, He, 50. C @ 4. min, 6. K/min, 300. C @ 20. min |
Packed | SE-30 | 1619. | Messadi and Vergnaud, 1979 | N2, Chromosorb Q, 10. K/min; Tstart: 100. C; Tend: 340. C |

Van Den Dool and Kratz RI, non-polar column, custom temperature program

Column type | Active phase | I | Reference | Comment |
---|---|---|---|---|
Capillary | VF-5MS | 1650.5 | Tret'yakov, 2008 | 30. m/0.25 mm/0.25 μm, He; Program: Multi-step temperature program; T(initial)=60C; T(final)=270C |

Van Den Dool and Kratz RI, polar column, temperature ramp

Column type | Active phase | I | Reference | Comment |
---|---|---|---|---|
Packed | Carbowax 20M | 2212. | van den Dool and Kratz, 1963 | Celite 545, 4.6 K/min; Tstart: 75. C; Tend: 228. C |

Normal alkane RI, non-polar column, temperature ramp

Column type | Active phase | I | Reference | Comment |
---|---|---|---|---|
Capillary | HP-5MS | 1650. | Hadaruga, Hadaruga, et al., 2006 | 30. m/0.25 mm/0.25 μm, He, 4. K/min; Tstart: 50. C; Tend: 250. C |
Capillary | Ultra-1 | 1616. | Okumura, 1991 | 25. m/0.32 mm/0.25 μm, He, 3. K/min; Tstart: 80. C; Tend: 260. C |
Capillary | OV-101 | 1612. | Pinkston, Spiteller, et al., 1981 | H2, 80. C @ 7. min, 2. K/min; Column length: 30. m; Column diameter: 0.3 mm; Tend: 275. C |
Capillary | OV-101 | 1612. | Spiteller and Spiteller, 1979 | He, 75. C @ 7. min, 2. K/min; Column length: 25. m; Tend: 280. C |

Normal alkane RI, non-polar column, custom temperature program

Column type | Active phase | I | Reference | Comment |
---|---|---|---|---|
Capillary | SE-30 | 1616. | Vinogradov, 2004 | Program: not specified |
Capillary | HP-1 | 1615. | Rowland, Blackman, et al., 1995 | 25. m/0.25 mm/0.25 μm; Program: 30 0C (4 min) 6 K/min -> 200 0C 15 K/min -> 250 0C (20 min) |
Capillary | OV-1, SE-30, Methyl silicone, SP-2100, OV-101, DB-1, etc. | 1645. | Waggott and Davies, 1984 | Hydrogen; Column length: 50. m; Column diameter: 0.32 mm; Program: not specified |
Other | Methyl Silicone | 1634. | Ardrey and Moffat, 1981 | Program: not specified |

Normal alkane RI, polar column, temperature ramp

Column type | Active phase | I | Reference | Comment |
---|---|---|---|---|
Capillary | DB-Wax | 2220. | Zhao, Xu, et al., 2009 | 30. m/0.25 mm/0.25 μm, Helium, 40. C @ 2. min, 3. K/min, 230. C @ 5. min |

Normal alkane RI, polar column, custom temperature program

Column type | Active phase | I | Reference | Comment |
---|---|---|---|---|
Capillary | Carbowax 20M | 2195. | Vinogradov, 2004 | Program: not specified |

Lee's RI, non-polar column, temperature ramp

Column type | Active phase | I | Reference | Comment |
---|---|---|---|---|
Capillary | DB-1 | 282.9 | Johnson, Urso, et al., 1997 | 30. m/0.2 mm/0.25 μm, 50. C @ 2. min, 5. K/min, 300. C @ 5. min |
Capillary | DB-1 | 283.0 | Johnson, Urso, et al., 1997 | 30. m/0.2 mm/0.25 μm, 50. C @ 2. min, 5. K/min, 300. C @ 5. min |
Capillary | DB-1 | 283.0 | Johnson, Urso, et al., 1997 | 30. m/0.2 mm/0.25 μm, 50. C @ 2. min, 5. K/min, 300. C @ 5. min |
Capillary | DB-5 | 279.26 | Rostad and Pereira, 1986 | 30. m/0.26 mm/0.25 μm, He, 50. C @ 4. min, 6. K/min, 300. C @ 20. min |

References

Verkade, Coops, et al., 1926
Verkade, P.E.; Coops, J.; Hartman, H.,
Calorimetric researches. XIII. Heats of combustion of successive terms of homologous series: Dimethyl esters of the oxalic acid series. A general survey of the oscillation phenomena,
Recl. Trav. Chim. Pays-Bas, 1926, 45, 585-606. [all data]
Cheshko and Shvaika, 1971
Cheshko, F.F.; Shvaika, T.N.,
Syntheses and Identification of Esters of Certain Mono- and Di-carboxylic Acids,
Zh. Prikl. Khim., 1971, 44, 1107-16. [all data]
Trent, Miller, et al., 1960
Trent, F.M.; Miller, F.D.; Brown, G.H.,
Some Physical Properties of Certain C9 and C10 Aliphatic Acids and Their Methyl Esters esters of 2-ethylpentanoic, pelargonic, 2,5-diethyladipic, 2-ethylsuberic, and sebacic acids.,
J. Chem. Eng. Data, 1960, 5, 110-1. [all data]
Soffer, Strauss, et al., 1947
Soffer, M.D.; Strauss, N.S.; Trail, M.D.; Sherk, K.W.,
J. Am. Chem. Soc., 1947, 69, 1684. [all data]
Houston and Furlow, 1946
Houston, D.F.; Furlow, J.S.,
Analysis of Binary Mixtures of Normal, Aliphatic, Dibasic Acids and Esters. Use of Refractive Indices of Dimethyl Esters,
Ind. Eng. Chem., Anal. Ed., 1946, 18, 541-2. [all data]
Karvonen, 1929
Karvonen, A.,
Methyl Sebacate,
Acta Chem. Fenn., 1929, 2, 101-3. [all data]
Verevkin, Kozlova, et al., 2006
Verevkin, Sergey P.; Kozlova, Svetlana A.; Emel'yanenko, Vladimir N.; Nikitin, Eugene D.; Popov, Alexander P.; Krasnykh, Eugen L.,
Vapor Pressures, Enthalpies of Vaporization, and Critical Parameters of a Series of Linear Aliphatic Dimethyl Esters of Dicarboxylic Acids,
J. Chem. Eng. Data, 2006, 51, 5, 1896-1905, https://doi.org/10.1021/je0602418
. [all data]
Aldrich Chemical Company Inc., 1990
Aldrich Chemical Company Inc.,
Catalog Handbook of Fine Chemicals, Aldrich Chemical Company, Inc., Milwaukee WI, 1990, 1. [all data]
Weast and Grasselli, 1989
CRC Handbook of Data on Organic Compounds, 2nd Editon, Weast,R.C and Grasselli, J.G., ed(s)., CRC Press, Inc., Boca Raton, FL, 1989, 1. [all data]
Herrmann, Dufka, et al., 1986
Herrmann, F.; Dufka, O.; Churacek, J.,
Fused-Silica Capillary Gas Chromatography-Mass Spectrometry of Some Dicarboxylic Acids Present in Condensation-Type Polymers I. Dimethyl Esters,
J. Chromatogr., 1986, 360, 79-88, https://doi.org/10.1016/S0021-9673(00)91653-4
. [all data]
Zulaïca and Guiochon, 1963
Zulaïca, J.; Guiochon, G.,
Séparation et identification de di-esters aliphatiques et aromatiques et de trimesters phosphoriques par chromatographie en phase gazeuse,
Bull. Soc. Chim. Fr., 1963, 6, 1242-1252. [all data]
Alley and Dykes, 1972
Alley, B.J.; Dykes, H.W.H.,
Gas-Liquid Chromatographic Determination of Nitrate Esters,Stabilizers and Plasticizers in Nitrocellulose-Base Propellants,
J. Chromatogr., 1972, 71, 1, 23-37, https://doi.org/10.1016/S0021-9673(01)85687-9
. [all data]
Ramsey, Lee, et al., 1980
Ramsey, J.D.; Lee, T.D.; Osselton, M.D.; Moffat, A.C.,
Gas-liquid chromatographic retention indices of 296 non-drug substances on SE-30 or OV-1 likely to be encountered in toxicological analyses,
J. Chromatogr., 1980, 184, 2, 185-206, https://doi.org/10.1016/S0021-9673(00)85641-1
. [all data]
Johnson, Urso, et al., 1997
Johnson, C.I.; Urso, A.; Geleta, L.,
Broad spectrum analysis of municipal and industrial effluents discharged into the Peace, Athabasca and Slave river basins: characterization of effluent samples, 1994 - Volume 1 of 2, Northern River Basins Study Project Report No. 121, Norther River Basins Study, Edmonton, Alberta, 1997, 27. [all data]
Helaimia and Messadi, 1989
Helaimia, F.; Messadi, D.,
Determination of linear programmed temperature gas chromatography retention indices for some plasticizers,
C.R. Acad. Sci. Ser. 2:, 1989, 309, 37-42. [all data]
Tan, Holland, et al., 1988
Tan, S.-T.; Holland, P.T.; Wilkins, A.L.; Molan, P.C.,
Extractives from New Zealand honeys. 1. White clovers, manuka, and kanuka unifloral honeys,
J. Agric. Food Chem., 1988, 36, 3, 453-460, https://doi.org/10.1021/jf00081a012
. [all data]
Rostad and Pereira, 1986
Rostad, C.E.; Pereira, W.E.,
Kovats and Lee retention indices determined by gas chromatography/mass spectrometry for organic compounds of environmental interest,
J. Hi. Res. Chromatogr. Chromatogr. Comm., 1986, 9, 6, 328-334, https://doi.org/10.1002/jhrc.1240090603
. [all data]
Messadi and Vergnaud, 1979
Messadi, D.; Vergnaud, J.-M.,
Quick identification and analysis of plasticizers in PVC by programmed-temperature gas chromatography using the best stationary phases,
J. Appl. Polym. Sci., 1979, 24, 5, 1215-1225, https://doi.org/10.1002/app.1979.070240507
. [all data]
Tret'yakov, 2008
Tret'yakov, K.V.,
Retention Data. NIST Mass Spectrometry Data Center., NIST Mass Spectrometry Data Center, 2008. [all data]
van den Dool and Kratz, 1963
van den Dool, H.; Kratz, P. Dec.,
A generalization of the retention index system including linear temperature programmed gas-liquid partition chromatography,
J. Chromatogr., 1963, 11, 463-471, https://doi.org/10.1016/S0021-9673(01)80947-X
. [all data]
Hadaruga, Hadaruga, et al., 2006
Hadaruga, N.G.; Hadaruga, D.I.; Paunescu, V.; Tatu, C.; Ordodi, V.L.; Bandur, G.; Lupea, A.X.,
Thermal stability of the linoleic acid/α- and β-cyclodextrin complexes,
Food Chem., 2006, 99, 3, 500-508, https://doi.org/10.1016/j.foodchem.2005.08.012
. [all data]
Okumura, 1991
Okumura, T.,
retention indices of environmental chemicals on methyl silicone capillary column,
Journal of Environmental Chemistry (Japan), 1991, 1, 2, 333-358, https://doi.org/10.5985/jec.1.333
. [all data]
Pinkston, Spiteller, et al., 1981
Pinkston, D.; Spiteller, G.; von Henning, H.; Matthaei, D.,
High-resolution gas chromatography-mass spectrometry of the methyl esters of organic acids from uremic hemofiltrates,
J. Chromatogr., 1981, 223, 1, 1-19, https://doi.org/10.1016/S0378-4347(00)80063-8
. [all data]
Spiteller and Spiteller, 1979
Spiteller, M.; Spiteller, G.,
Trennung und charakterisierung saurer harnbest and- teile,
J. Chromatogr., 1979, 164, 3, 253-317, https://doi.org/10.1016/S0378-4347(00)81232-3
. [all data]
Vinogradov, 2004
Vinogradov, B.A.,
Production, composition, properties and application of essential oils, 2004, retrieved from http://viness.narod.ru. [all data]
Rowland, Blackman, et al., 1995
Rowland, C.Y.; Blackman, A.J.; D'Arcy, B.R.; Rintoul, G.B.,
Comparison of organic extractives found in leatherwood (Eucryphia lucida) honey and leatherwood flowers and leaves,
J. Agric. Food Chem., 1995, 43, 3, 753-763, https://doi.org/10.1021/jf00051a036
. [all data]
Waggott and Davies, 1984
Waggott, A.; Davies, I.W.,
Identification of organic pollutants using linear temperature programmed retention indices (LTPRIs) - Part II, 1984, retrieved from http://dwi.defra.gov.uk/research/completed-research/reports/dwi0383.pdf. [all data]
Ardrey and Moffat, 1981
Ardrey, R.E.; Moffat, A.C.,
Gas-liquid chromatographic retention indices of 1318 substances of toxicological interest on SE-30 or OV-1 stationary phase,
J. Chromatogr., 1981, 220, 3, 195-252, https://doi.org/10.1016/S0021-9673(00)81925-1
. [all data]
Zhao, Xu, et al., 2009
Zhao, Y.; Xu, Y.; Li, J.; Fan, W.; Jiang, W.,
Profile of volatile compounds in 11 brandies by headspace solid-phase microextraction followed by gas chromatography-mass spectrometry,
J. Food. Sci., 2009, 74, 2, c90-c99, https://doi.org/10.1111/j.1750-3841.2008.01029.x
. [all data]