2-Ethoxyethyl acrylate
- Formula: C7H12O3
- Molecular weight: 144.1684
- IUPAC Standard InChIKey: FWWXYLGCHHIKNY-UHFFFAOYSA-N
- CAS Registry Number: 106-74-1
- Chemical structure:
View 3d structure (requires JavaScript / HTML 5) - Other names: 2-Propenoic acid, 2-ethoxyethyl ester; Acrylic acid, 2-ethoxyethanol ester; Acrylic acid, 2-ethoxyethyl ester; Cellosolve acrylate; Ethanol, 2-ethoxy-, acrylate; Ethoxyethyl acrylate; Ethylene glycol monoethyl ether acrylate; Ethylene glycol monoethyl ether propenoate; 2-Ethoxyethyl 2-propenoate; 2-Ethoxyethylester kyseliny akrylove

Phase change data

Data compiled by: Thermodynamics Research Center, NIST Boulder Laboratories, Chris Muzny director
Quantity | Value | Units | Method | Reference | Comment |
---|---|---|---|---|---|
Tfus | 225.9 | K | N/A | Anonymous, 1957 | Uncertainty assigned by TRC = 0.6 K |

References

Anonymous, 1957
Anonymous, R.,
, Am. Pet. Inst. Res. Proj. 6, Carnegie-Mellon Univ., 1957. [all data]