Heptanoic acid, methyl ester
- Formula: C8H16O2
- Molecular weight: 144.2114
- IUPAC Standard InChIKey: XNCNNDVCAUWAIT-UHFFFAOYSA-N
- CAS Registry Number: 106-73-0
- Chemical structure:
View 3d structure (requires JavaScript / HTML 5) - Other names: Methyl enanthate; Methyl heptanoate; Methyl heptoate; Methyl n-heptanoate; Methyl n-heptylate; Methyl oenanthylate; Methyl ester of heptanoic acid

Gas phase thermochemistry data

Data compiled by: Hussein Y. Afeefy, Joel F. Liebman, and Stephen E. Stein
Quantity | Value | Units | Method | Reference | Comment |
---|---|---|---|---|---|
ΔfH°gas | -517. ± 2. | kJ/mol | Ccb | Adriaanse, Dekker, et al., 1965 | Heat of formation derived by Cox and Pilcher, 1970 |

Condensed phase thermochemistry data

Data compiled as indicated in comments:
ALS - Hussein Y. Afeefy, Joel F. Liebman, and Stephen E. Stein
DH - Eugene S. Domalski and Elizabeth D. Hearing
Quantity | Value | Units | Method | Reference | Comment |
---|---|---|---|---|---|
ΔfH°liquid | -567.10 ± 0.92 | kJ/mol | Ccb | Adriaanse, Dekker, et al., 1965 | Heat of formation derived by Cox and Pilcher, 1970; ALS |
Quantity | Value | Units | Method | Reference | Comment |
ΔcH°liquid | -4867.4 ± 0.8 | kJ/mol | Ccb | Adriaanse, Dekker, et al., 1965 | Corresponding ΔfHºliquid = -567.3 kJ/mol (simple calculation by NIST; no Washburn corrections); ALS |
Constant pressure heat capacity of liquid
Cp,liquid (J/mol*K) | Temperature (K) | Reference | Comment |
---|---|---|---|
285.1 | 298.15 | Fuchs, 1979 | DH |

Phase change data

Data compiled as indicated in comments:
BS - Robert L. Brown and Stephen E. Stein
TRC - Thermodynamics Research Center, NIST Boulder Laboratories, Chris Muzny director
AC - William E. Acree, Jr., James S. Chickos
ALS - Hussein Y. Afeefy, Joel F. Liebman, and Stephen E. Stein
DRB - Donald R. Burgess, Jr.
Quantity | Value | Units | Method | Reference | Comment |
---|---|---|---|---|---|
Tboil | 445.2 | K | N/A | Weast and Grasselli, 1989 | BS |
Tboil | 446.95 | K | N/A | Bilterys and Gisseleire, 1935 | Uncertainty assigned by TRC = 0.3 K; TRC |
Tboil | 445.3 | K | N/A | Gartenmeister, 1886 | Uncertainty assigned by TRC = 2. K; TRC |
Quantity | Value | Units | Method | Reference | Comment |
Tfus | 217.4 | K | N/A | Adriaanse, Dekker, et al., 1964 | Uncertainty assigned by TRC = 0.05 K; TRC |
Tfus | 217.4 | K | N/A | Bilterys and Gisseleire, 1935 | Uncertainty assigned by TRC = 0.5 K; TRC |
Quantity | Value | Units | Method | Reference | Comment |
ΔvapH° | 52. ± 3. | kJ/mol | AVG | N/A | Average of 12 values; Individual data points |
Enthalpy of vaporization
ΔvapH (kJ/mol) | Temperature (K) | Method | Reference | Comment |
---|---|---|---|---|
46.3 | 433. | N/A | Postigo, Mariano, et al., 2009 | Based on data from 421. to 444. K.; AC |
49.1 | 350. | N/A | van Genderen, van Miltenburg, et al., 2002 | AC |
50.2 ± 0.1 | 326. | N/A | van Genderen, van Miltenburg, et al., 2002 | AC |
49.0 | 347. | A,EST | Stephenson and Malanowski, 1987 | Based on data from 332. to 402. K. See also Rose and Schrodt, 1963.; AC |

Kovats' RI, polar column, temperature ramp

Data compiled by: NIST Mass Spectrometry Data Center, William E. Wallace, director

Column type Capillary
Active phase Carbowax 20M
Column length (m) 50.
Carrier gas He
Substrate
Column diameter (mm) 0.28
Phase thickness (μm)
Tstart (C) 70.
Tend (C) 190.
Heat rate (K/min) 2.
Initial hold (min)
Final hold (min)
I 1281.
ReferenceTressl, Friese, et al., 1978
Comment MSDC-RI

Van Den Dool and Kratz RI, non-polar column, custom temperature program

Data compiled by: NIST Mass Spectrometry Data Center, William E. Wallace, director

Column type CapillaryCapillaryCapillaryCapillaryCapillary
Active phase VF-5MSVF-5MSDB-5DB-1DB-1
Column length (m) 30.30.30.60.60.
Carrier gas HeHeHeHeHe
Substrate
Column diameter (mm) 0.250.250.250.250.25
Phase thickness (μm) 0.250.250.250.250.25
Program Multi-step temperature program; T(initial)=60C; T(final)=270CMulti-step temperature program; T(initial)=60C; T(final)=270C50C (1min) => 5C/min => 100C => 10C/min => 250C (9min)-20C (5min) => 10C/min => 100C => 4C/min => 200C => 10C/min => 280C-20C (5min) => 10C/min => 100C => 4C/min => 200C => 10C/min => 280C
I 1027.71028.41021.1005.1004.
ReferenceTret'yakov, 2007Tret'yakov, 2007Beaulieu and Grimm, 2001Eri, Khoo, et al., 2000Eri, Khoo, et al., 2000
Comment MSDC-RI MSDC-RI MSDC-RI MSDC-RI MSDC-RI
Column type CapillaryPacked
Active phase DB-1SE-30
Column length (m) 15.3.05
Carrier gas He
Substrate  Supelcoport; Chromosorb
Column diameter (mm) 0.53
Phase thickness (μm) 1.
Program 40C(3min) => 8C/min => 200(1min) => 5C/min => 300C(25min)40C(5min) => 10C/min => 200C or 250C (60min)
I 1007.1007.
ReferencePeng, 2000Peng, Ding, et al., 1988
Comment MSDC-RI MSDC-RI

Kovats' RI, polar column, isothermal

Data compiled by: NIST Mass Spectrometry Data Center, William E. Wallace, director

Column type CapillaryPacked
Active phase Carbowax 20MPolyethylene Glycol
Column length (m) 22.2.
Carrier gas N2He
Substrate  Celite 545 (0.20-0.50 mm)
Column diameter (mm) 0.3
Phase thickness (μm)
Temperature (C) 100.170.
I 1241.1327.
ReferenceHaken and Korhonen, 1984Shashkova, Znamenskaia, et al., 1969
Comment MSDC-RI MSDC-RI

References

Adriaanse, Dekker, et al., 1965
Adriaanse, N.; Dekker, H.; Coops, J.,
Heats of combustion of normal saturated fatty acids and their methyl esters,
Rec. Trav. Chim. Pays/Bas, 1965, 84, 393-407. [all data]
Cox and Pilcher, 1970
Cox, J.D.; Pilcher, G.,
Thermochemistry of Organic and Organometallic Compounds, Academic Press, New York, 1970, 1-636. [all data]
Fuchs, 1979
Fuchs, R.,
Heat capacities of some liquid aliphatic, alicyclic, and aromatic esters at 298.15 K,
J. Chem. Thermodyn., 1979, 11, 959-961. [all data]
Weast and Grasselli, 1989
CRC Handbook of Data on Organic Compounds, 2nd Editon, Weast,R.C and Grasselli, J.G., ed(s)., CRC Press, Inc., Boca Raton, FL, 1989, 1. [all data]
Bilterys and Gisseleire, 1935
Bilterys, R.; Gisseleire, J.,
Investigations on the Congelation Temperature of Organic Compounds,
Bull. Soc. Chim. Belg., 1935, 44, 567. [all data]
Gartenmeister, 1886
Gartenmeister, R.,
Investigation of the physical characterstics of liquid compounds: vi boiling point and specific volume of normal fatty acid esters,
Justus Liebigs Ann. Chem., 1886, 233, 249-315. [all data]
Adriaanse, Dekker, et al., 1964
Adriaanse, N.; Dekker, H.; Coops, J.,
Some Physical Constants of Normal, Saturated Fatty Acids and Their Methyl Esters,
Recl. Trav. Chim. Pays-Bas, 1964, 83, 557. [all data]
Postigo, Mariano, et al., 2009
Postigo, Miguel A.; Mariano, Alejandra B.; Jara, Andrea F.; Zurakoski, Natasha,
Isobaric Vapor-Liquid Equilibria for the Binary Systems Benzene + Methyl Ethanoate, Benzene + Butyl Ethanoate, and Benzene + Methyl Heptanoate at 101.31 kPa «8224»,
J. Chem. Eng. Data, 2009, 54, 5, 1575-1579, https://doi.org/10.1021/je800915d
. [all data]
van Genderen, van Miltenburg, et al., 2002
van Genderen, Aad C.G.; van Miltenburg, J. Cees; Blok, Jacobus G.; van Bommel, Mark J.; van Ekeren, Paul J.; van den Berg, Gerrit J.K.; Oonk, Harry A.J.,
Liquid--vapour equilibria of the methyl esters of alkanoic acids: vapour pressures as a function of temperature and standard thermodynamic function changes,
Fluid Phase Equilibria, 2002, 202, 1, 109-120, https://doi.org/10.1016/S0378-3812(02)00097-3
. [all data]
Stephenson and Malanowski, 1987
Stephenson, Richard M.; Malanowski, Stanislaw,
Handbook of the Thermodynamics of Organic Compounds, 1987, https://doi.org/10.1007/978-94-009-3173-2
. [all data]
Rose and Schrodt, 1963
Rose, Arthur; Schrodt, Verle N.,
Correlation and Prediction of Vapor Pressures of Homologs. Use of Structure Parameters and Gas Chromatography Data.,
J. Chem. Eng. Data, 1963, 8, 1, 9-13, https://doi.org/10.1021/je60016a002
. [all data]