Pentane, 3,3-diethyl-
- Formula: C9H20
- Molecular weight: 128.2551
- IUPAC Standard InChIKey: BGXXXYLRPIRDHJ-UHFFFAOYSA-N
- CAS Registry Number: 1067-20-5
- Chemical structure:
View 3d structure (requires JavaScript / HTML 5) - Other names: Tetraethylmethane; 3,3-Diethylpentane

Gas phase thermochemistry data

Data compiled by: Glushko Thermocenter, Russian Academy of Sciences, Moscow
Quantity | Value | Units | Method | Reference | Comment |
---|---|---|---|---|---|
S°gas | 436.52 | J/mol*K | N/A | Finke H.L., 1976 |
Constant pressure heat capacity of gas
Cp,gas (J/mol*K) | Temperature (K) | Reference | Comment |
---|---|---|---|
153.89 | 200. | Scott D.W., 1974 | Recommended values were obtained from the consistent correlation scheme for alkanes [ Scott D.W., 1974, 2, Scott D.W., 1974]. This approach gives a good agreement with experimental data available for alkanes. However, large uncertainties could be expected at high temperatures. |
201.38 | 273.15 | ||
216.7 ± 4.2 | 298.15 | ||
217.86 | 300. | ||
276.31 | 400. | ||
328.49 | 500. | ||
373.63 | 600. | ||
412.54 | 700. | ||
445.60 | 800. | ||
474.47 | 900. | ||
499.15 | 1000. | ||
520.91 | 1100. | ||
539.74 | 1200. | ||
556.47 | 1300. | ||
573.21 | 1400. | ||
585.76 | 1500. |

Condensed phase thermochemistry data

Data compiled as indicated in comments:
ALS - Hussein Y. Afeefy, Joel F. Liebman, and Stephen E. Stein
DH - Eugene S. Domalski and Elizabeth D. Hearing
Quantity | Value | Units | Method | Reference | Comment |
---|---|---|---|---|---|
ΔcH°liquid | -6124.5 ± 1.6 | kJ/mol | Ccb | Johnson, Prosen, et al., 1947 | Corresponding ΔfHºliquid = -275.4 kJ/mol (simple calculation by NIST; no Washburn corrections); ALS |
Quantity | Value | Units | Method | Reference | Comment |
S°liquid | 333.4 | J/mol*K | N/A | Finke, Messerly, et al., 1976 | DH |
Constant pressure heat capacity of liquid
Cp,liquid (J/mol*K) | Temperature (K) | Reference | Comment |
---|---|---|---|
278.2 | 298.15 | Fuchs and Peacock, 1979 | DH |
278.8 | 298.15 | Finke, Messerly, et al., 1976 | T = 10 to 400 K.; DH |
260.9 | 260. | Staveley, Warren, et al., 1954 | T = 90 to 260 K.; DH |

Phase change data

Data compiled as indicated in comments:
BS - Robert L. Brown and Stephen E. Stein
TRC - Thermodynamics Research Center, NIST Boulder Laboratories, Chris Muzny director
ALS - Hussein Y. Afeefy, Joel F. Liebman, and Stephen E. Stein
AC - William E. Acree, Jr., James S. Chickos
CAL - James S. Chickos, William E. Acree, Jr., Joel F. Liebman, Students of Chem 202 (Introduction to the Literature of Chemistry), University of Missouri -- St. Louis
DH - Eugene S. Domalski and Elizabeth D. Hearing
Quantity | Value | Units | Method | Reference | Comment |
---|---|---|---|---|---|
Tboil | 419.3 ± 0.4 | K | AVG | N/A | Average of 12 out of 13 values; Individual data points |
Quantity | Value | Units | Method | Reference | Comment |
Tfus | 241. ± 2. | K | AVG | N/A | Average of 13 out of 14 values; Individual data points |
Quantity | Value | Units | Method | Reference | Comment |
Ttriple | 240.1 | K | N/A | Finke, Messerly, et al., 1976, 2 | Crystal phase 1 phase; Uncertainty assigned by TRC = 0.03 K; TRC |
Ttriple | 240.13 | K | N/A | Staveley, Warren, et al., 1954, 2 | Crystal phase 1 phase; Uncertainty assigned by TRC = 0.2 K; TRC |
Ttriple | 240.11 | K | N/A | Waddington, 1950 | Crystal phase 1 phase; Uncertainty assigned by TRC = 0.04 K; TRC |
Quantity | Value | Units | Method | Reference | Comment |
ΔvapH° | 42.03 | kJ/mol | N/A | Majer and Svoboda, 1985 | |
ΔvapH° | 42.6 ± 0.3 | kJ/mol | C | Fuchs and Peacock, 1979 | ALS |
ΔvapH° | 42.6 ± 0.3 | kJ/mol | GCC | Fuchs and Peacock, 1979 | AC |
ΔvapH° | 43.6 | kJ/mol | N/A | Reid, 1972 | See also Labbauf, Greenshields, et al., 1961.; AC |
Enthalpy of vaporization
ΔvapH (kJ/mol) | Temperature (K) | Method | Reference | Comment |
---|---|---|---|---|
39.8 | 350. | A | Stephenson and Malanowski, 1987 | Based on data from 335. to 426. K. See also Forziati, Norris, et al., 1949.; AC |
34.61 | 419.4 | N/A | Majer and Svoboda, 1985 |
Antoine Equation Parameters
log10(P) = A − (B / (T + C))
P = vapor pressure (bar)
T = temperature (K)
View plot Requires a JavaScript / HTML 5 canvas capable browser.
Temperature (K) | A | B | C | Reference | Comment |
---|---|---|---|---|---|
336.03 to 420.34 | 4.02803 | 1458.142 | -56.803 | Forziati, Norris, et al., 1949, 2 | Coefficents calculated by NIST from author's data. |
Enthalpy of fusion
ΔfusH (kJ/mol) | Temperature (K) | Reference | Comment |
---|---|---|---|
10.09 | 240.1 | Domalski and Hearing, 1996 | AC |
Entropy of fusion
ΔfusS (J/mol*K) | Temperature (K) | Reference | Comment |
---|---|---|---|
2.32 | 208.3 | Domalski and Hearing, 1996 | CAL |
3.85 | 210.4 | ||
42.02 | 240.1 |
Enthalpy of phase transition
ΔHtrs (kJ/mol) | Temperature (K) | Initial Phase | Final Phase | Reference | Comment |
---|---|---|---|---|---|
0.4837 | 208.25 | crystaline, III | crystaline, II | Finke, Messerly, et al., 1976 | DH |
0.8104 | 210.4 | crystaline, II | crystaline, I | Finke, Messerly, et al., 1976 | DH |
10.0897 | 240.10 | crystaline, I | liquid | Finke, Messerly, et al., 1976 | DH |
1.272 | 210.1 | crystaline, II | crystaline, I | Staveley, Warren, et al., 1954 | Combined heats of transition for multiple phases.; DH |
10.033 | 240.13 | crystaline, I | liquid | Staveley, Warren, et al., 1954 | Combined entropies of fusion and transition.; DH |
Entropy of phase transition
ΔStrs (J/mol*K) | Temperature (K) | Initial Phase | Final Phase | Reference | Comment |
---|---|---|---|---|---|
2.32 | 208.25 | crystaline, III | crystaline, II | Finke, Messerly, et al., 1976 | DH |
3.85 | 210.4 | crystaline, II | crystaline, I | Finke, Messerly, et al., 1976 | DH |
42.02 | 240.10 | crystaline, I | liquid | Finke, Messerly, et al., 1976 | DH |
47.82 | 240.13 | crystaline, I | liquid | Staveley, Warren, et al., 1954 | Combined; DH |

Henry's Law data

Data compiled by: Rolf Sander
Henry's Law constant (water solution)
kH(T) = k°H exp(d(ln(kH))/d(1/T) ((1/T) - 1/(298.15 K)))
k°H = Henry's law constant for solubility in water at 298.15 K (mol/(kg*bar))
d(ln(kH))/d(1/T) = Temperature dependence constant (K)
k°H (mol/(kg*bar)) | d(ln(kH))/d(1/T) (K) | Method | Reference | Comment |
---|---|---|---|---|
0.00015 | Q | N/A | missing citation give several references for the Henry's law constants but don't assign them to specific species. |

Kovats' RI, non-polar column, isothermal

Column type | Active phase | Temperature (C) | I | Reference | Comment |
---|---|---|---|---|---|
Capillary | Squalane | 100. | 880. | Heinzen, Soares, et al., 1999 | |
Capillary | Squalane | 25. | 871. | Hilal, Carreira, et al., 1994 | |
Capillary | Squalane | 50. | 877.1 | Lunskii and Paizanskaya, 1988 | He; Column length: 50. m; Column diameter: 0.22 mm |
Capillary | Squalane | 70. | 882.4 | Lunskii and Paizanskaya, 1988 | He; Column length: 50. m; Column diameter: 0.22 mm |
Capillary | DB-1 | 60. | 875.3 | Lubeck and Sutton, 1983 | Column length: 60. m; Column diameter: 0.264 mm |
Capillary | DB-1 | 60. | 875.6 | Lubeck and Sutton, 1983 | 60. m/0.259 mm/1. μm |
Capillary | Squalane | 86. | 886.4 | Nabivach and Kirilenko, 1979 | N2; Column length: 50. m |
Capillary | Squalane | 86. | 886.9 | Nabivach and Kirilenko, 1979 | N2; Column length: 50. m |
Capillary | Squalane | 60. | 880. | Chretien and Dubois, 1976 | |
Capillary | Squalane | 60. | 880.2 | Chretien and Dubois, 1976 | |
Capillary | Vacuum Grease Oil (VM-4) | 95. | 885.8 | Sultanov and Arustamova, 1975 | N2; Column length: 150. m; Column diameter: 0.25 mm |
Capillary | Squalane | 50. | 877. | Rijks and Cramers, 1974 | N2; Column length: 100. m; Column diameter: 0.25 mm |
Capillary | Squalane | 70. | 882. | Rijks and Cramers, 1974 | N2; Column length: 100. m; Column diameter: 0.25 mm |
Capillary | Squalane | 70. | 877.5 | Dimov and Schopov, 1971 | Column length: 100. m; Column diameter: 0.25 mm |
Packed | Squalane | 50. | 877.6 | Takács, Szita, et al., 1971 | N2, Chromosorb W; Column length: 3. m |
Capillary | Squalane | 60. | 880. | Matukuma, 1969 | N2; Column length: 91.4 m; Column diameter: 0.25 mm |
Capillary | Squalane | 30. | 872. | Tourres, 1967 | H2; Column length: 100. m; Column diameter: 0.25 mm |
Capillary | Squalane | 50. | 878. | Tourres, 1967 | H2; Column length: 100. m; Column diameter: 0.25 mm |
Capillary | Squalane | 70. | 883. | Tourres, 1967 | H2; Column length: 100. m; Column diameter: 0.25 mm |

Kovats' RI, non-polar column, temperature ramp

Column type | Active phase | I | Reference | Comment |
---|---|---|---|---|
Capillary | DB-5 | 917. | Ramarathnam, Rubin, et al., 1993 | He, 30. C @ 2. min, 10. K/min, 280. C @ 3. min; Column length: 30. m; Column diameter: 0.13 mm |
Capillary | Apiezon L | 890. | Louis, 1971 | N2, 1. K/min; Column length: 50. m; Column diameter: 0.25 mm; Tstart: 60. C |

Kovats' RI, non-polar column, custom temperature program

Column type | Active phase | I | Reference | Comment |
---|---|---|---|---|
Capillary | Petrocol DH-100 | 880.62 | Haagen-Smit Laboratory, 1997 | He; Column length: 100. m; Column diameter: 0.2 mm; Program: 5C(10min) => 5C/min => 50C(48min) => 1.5C/min => 195C(91min) |

Van Den Dool and Kratz RI, non-polar column, temperature ramp

Column type | Active phase | I | Reference | Comment |
---|---|---|---|---|
Capillary | Petrocol DH | 874. | White, Hackett, et al., 1992 | 100. m/0.25 mm/0.5 μm, He, 1. K/min; Tstart: 30. C; Tend: 220. C |
Capillary | SE-30 | 875.2 | Krupcík, Repka, et al., 1987 | 60. m/0.25 mm/1. μm, H2, 1. K/min; Tstart: 60. C |

Normal alkane RI, non-polar column, temperature ramp

Column type | Active phase | I | Reference | Comment |
---|---|---|---|---|
Capillary | Polydimethyl siloxane: CP-Sil 5 CB | 875. | Bramston-Cook, 2013 | 60. m/0.25 mm/1.0 μm, Helium, 45. C @ 1.45 min, 3.6 K/min, 210. C @ 2.72 min |
Capillary | Petrocol DH | 880. | Supelco, 2012 | 100. m/0.25 mm/0.50 μm, Helium, 20. C @ 15. min, 15. K/min, 220. C @ 30. min |

Normal alkane RI, non-polar column, custom temperature program

Column type | Active phase | I | Reference | Comment |
---|---|---|---|---|
Capillary | OV-101 | 880. | Du and Liang, 2003 | Program: not specified |
Capillary | Polydimethyl siloxane | 880. | Junkes, Castanho, et al., 2003 | Program: not specified |

References

Finke H.L., 1976
Finke H.L.,
Low-temperature thermal quantities for five alkyl-substituted pentanes,
J. Chem. Thermodyn., 1976, 8, 965-983. [all data]
Scott D.W., 1974
Scott D.W.,
Chemical Thermodynamic Properties of Hydrocarbons and Related Substances. Properties of the Alkane Hydrocarbons, C1 through C10 in the Ideal Gas State from 0 to 1500 K. U.S. Bureau of Mines, Bulletin 666, 1974. [all data]
Scott D.W., 1974, 2
Scott D.W.,
Correlation of the chemical thermodynamic properties of alkane hydrocarbons,
J. Chem. Phys., 1974, 60, 3144-3165. [all data]
Johnson, Prosen, et al., 1947
Johnson, W.H.; Prosen, E.J.; Rossini, F.D.,
Heats of combustion and isomerization of six nonanes,
J. Res. NBS, 1947, 38, 419-422. [all data]
Finke, Messerly, et al., 1976
Finke, H.L.; Messerly, J.F.; Douslin, D.R.,
Low-temperature thermal quantities for five alkyl-substituted pentanes,
J. Chem. Thermodynam., 1976, 8, 965-983. [all data]
Fuchs and Peacock, 1979
Fuchs, R.; Peacock, L.A.,
Heats of vaporization and gaseous heats of formation of some five- and six-membered ring alkenes,
Can. J. Chem., 1979, 57, 2302-2304. [all data]
Staveley, Warren, et al., 1954
Staveley, L.A.K.; Warren, J.B.; Paget, H.P.; Dowrick, D.J.,
Some thermodynamic properties of compounds of the formula MX4. Part II. Tetra-alkyl compounds, 1954, J. [all data]
Finke, Messerly, et al., 1976, 2
Finke, H.L.; Messerly, J.F.; Douslin, D.R.,
Low-Temp. Thermal Quantities for Five Alkyl-Substituted Pentanes,
J. Chem. Thermodyn., 1976, 8, 965. [all data]
Staveley, Warren, et al., 1954, 2
Staveley, L.A.K.; Warren, J.B.; Paget, H.P.; Dowrick, D.J.,
Some Thermodynamic Properties of Compounds of the Formula MX4 II. Tetraalkyl Compounds,
J. Chem. Soc., 1954, 1954, 1992. [all data]
Waddington, 1950
Waddington, G.,
Personal Commun., U. S. Bur. Mines, Bartlesville, OK, March 2, 1950. [all data]
Majer and Svoboda, 1985
Majer, V.; Svoboda, V.,
Enthalpies of Vaporization of Organic Compounds: A Critical Review and Data Compilation, Blackwell Scientific Publications, Oxford, 1985, 300. [all data]
Reid, 1972
Reid, Robert C.,
Handbook on vapor pressure and heats of vaporization of hydrocarbons and related compounds, R. C. Wilhort and B. J. Zwolinski, Texas A Research Foundation. College Station, Texas(1971). 329 pages.$10.00,
AIChE J., 1972, 18, 6, 1278-1278, https://doi.org/10.1002/aic.690180637
. [all data]
Labbauf, Greenshields, et al., 1961
Labbauf, A.; Greenshields, J.B.; Rossini, F.D.,
Heats of formation, combustion, and vaporization of the 35 nonanes and 75 decanes,
J. Chem. Eng. Data, 1961, 6, 261-263. [all data]
Stephenson and Malanowski, 1987
Stephenson, Richard M.; Malanowski, Stanislaw,
Handbook of the Thermodynamics of Organic Compounds, 1987, https://doi.org/10.1007/978-94-009-3173-2
. [all data]
Forziati, Norris, et al., 1949
Forziati, Alphonse F.; Norris, William R.; Rossini, Frederick D.,
Vapor pressures and boiling points of sixty API-NBS hydrocarbons,
J. RES. NATL. BUR. STAN., 1949, 43, 6, 555-17, https://doi.org/10.6028/jres.043.050
. [all data]
Forziati, Norris, et al., 1949, 2
Forziati, A.F.; Norris, W.R.; Rossini, F.D.,
Vapor Pressures and Boiling Points of Sixty API-NBS Hydrocarbons,
J. Res. Natl. Bur. Stand. (U.S.), 1949, 43, 6, 555-563, https://doi.org/10.6028/jres.043.050
. [all data]
Domalski and Hearing, 1996
Domalski, Eugene S.; Hearing, Elizabeth D.,
Heat Capacities and Entropies of Organic Compounds in the Condensed Phase. Volume III,
J. Phys. Chem. Ref. Data, 1996, 25, 1, 1, https://doi.org/10.1063/1.555985
. [all data]