2-cyanoethyl acrylate
- Formula: C6H7NO2
- Molecular weight: 125.1253
- IUPAC Standard InChIKey: AEPWOCLBLLCOGZ-UHFFFAOYSA-N
- CAS Registry Number: 106-71-8
- Chemical structure:
View 3d structure (requires JavaScript / HTML 5) - Permanent link for this species. Use this link for bookmarking this species for future reference.

Phase change data

Data compiled by: Thermodynamics Research Center, NIST Boulder Laboratories, Chris Muzny director
Quantity | Value | Units | Method | Reference | Comment |
---|---|---|---|---|---|
Tfus | 256.3 | K | N/A | Anonymous, 1958 | Uncertainty assigned by TRC = 0.6 K |

References

Anonymous, 1958
Anonymous, R.,
, Am. Pet. Inst. Res. Proj. 45, Ohio State Univ., 1958. [all data]