Pentane, 3-ethyl-3-methyl-
- Formula: C8H18
- Molecular weight: 114.2285
- IUPAC Standard InChIKey: GIEZWIDCIFCQPS-UHFFFAOYSA-N
- CAS Registry Number: 1067-08-9
- Chemical structure:
View 3d structure (requires JavaScript / HTML 5) - Other names: 3-Ethyl-3-methylpentane; 3-Methyl-3-ethylpentane

Condensed phase thermochemistry data

Data compiled by: Hussein Y. Afeefy, Joel F. Liebman, and Stephen E. Stein
Quantity | Value | Units | Method | Reference | Comment |
---|---|---|---|---|---|
ΔfH°liquid | -253.0 ± 1.3 | kJ/mol | Ccb | Prosen and Rossini, 1945 | |
Quantity | Value | Units | Method | Reference | Comment |
ΔcH°liquid | -5467.7 ± 1.1 | kJ/mol | Ccb | Prosen and Rossini, 1945 | Corresponding ΔfHºliquid = -252.9 kJ/mol (simple calculation by NIST; no Washburn corrections) |

Phase change data

Data compiled as indicated in comments:
BS - Robert L. Brown and Stephen E. Stein
TRC - Thermodynamics Research Center, NIST Boulder Laboratories, Chris Muzny director
AC - William E. Acree, Jr., James S. Chickos
ALS - Hussein Y. Afeefy, Joel F. Liebman, and Stephen E. Stein
Quantity | Value | Units | Method | Reference | Comment |
---|---|---|---|---|---|
Tboil | 391.5 ± 0.3 | K | AVG | N/A | Average of 17 values; Individual data points |
Quantity | Value | Units | Method | Reference | Comment |
Tfus | 182.5 ± 0.8 | K | AVG | N/A | Average of 12 values; Individual data points |
Quantity | Value | Units | Method | Reference | Comment |
Tc | 576.5 ± 0.5 | K | N/A | Daubert, 1996 | |
Tc | 576.5 | K | N/A | Majer and Svoboda, 1985 | |
Tc | 576.51 | K | N/A | McMicking and Kay, 1965 | Uncertainty assigned by TRC = 0.4 K; TRC |
Quantity | Value | Units | Method | Reference | Comment |
Pc | 28.1 ± 0.4 | bar | N/A | Daubert, 1996 | |
Pc | 28.073 | bar | N/A | McMicking and Kay, 1965 | Uncertainty assigned by TRC = 0.4053 bar; TRC |
Quantity | Value | Units | Method | Reference | Comment |
Vc | 0.455 | l/mol | N/A | Daubert, 1996 | |
Quantity | Value | Units | Method | Reference | Comment |
ρc | 2.20 ± 0.04 | mol/l | N/A | Daubert, 1996 | |
ρc | 2.20 | mol/l | N/A | McMicking and Kay, 1965 | Uncertainty assigned by TRC = 0.04 mol/l; TRC |
Quantity | Value | Units | Method | Reference | Comment |
ΔvapH° | 38.05 | kJ/mol | N/A | Majer and Svoboda, 1985 | |
ΔvapH° | 38.0 | kJ/mol | N/A | Reid, 1972 | AC |
ΔvapH° | 38.0 ± 0.1 | kJ/mol | C | Osborne and Ginnings, 1947 | AC |
ΔvapH° | 37.98 | kJ/mol | C | Osborne and Ginnings, 1947, 2 | ALS |
Enthalpy of vaporization
ΔvapH (kJ/mol) | Temperature (K) | Method | Reference | Comment |
---|---|---|---|---|
32.78 | 391.4 | N/A | Majer and Svoboda, 1985 | |
36.9 | 327. | A,MM | Stephenson and Malanowski, 1987 | Based on data from 312. to 393. K. See also Willingham, Taylor, et al., 1945.; AC |
40.2 | 264. | N/A | Stull, 1947 | Based on data from 249. to 391. K.; AC |
Enthalpy of vaporization
ΔvapH =
A exp(-βTr) (1 − Tr)β
ΔvapH =
Enthalpy of vaporization (at saturation pressure)
(kJ/mol)
Tr = reduced temperature (T / Tc)
View plot Requires a JavaScript / HTML 5 canvas capable browser.
Temperature (K) | A (kJ/mol) | β | Tc (K) | Reference | Comment |
---|---|---|---|---|---|
298. to 391. | 52.46 | 0.2592 | 576.5 | Majer and Svoboda, 1985 |
Antoine Equation Parameters
log10(P) = A − (B / (T + C))
P = vapor pressure (bar)
T = temperature (K)
View plot Requires a JavaScript / HTML 5 canvas capable browser.
Temperature (K) | A | B | C | Reference | Comment |
---|---|---|---|---|---|
249.3 to 391.5 | 4.04817 | 1380.13 | -49.963 | Stull, 1947 | Coefficents calculated by NIST from author's data. |

Henry's Law data

Data compiled by: Rolf Sander
Henry's Law constant (water solution)
kH(T) = k°H exp(d(ln(kH))/d(1/T) ((1/T) - 1/(298.15 K)))
k°H = Henry's law constant for solubility in water at 298.15 K (mol/(kg*bar))
d(ln(kH))/d(1/T) = Temperature dependence constant (K)
k°H (mol/(kg*bar)) | d(ln(kH))/d(1/T) (K) | Method | Reference | Comment |
---|---|---|---|---|
0.00023 | Q | N/A | missing citation give several references for the Henry's law constants but don't assign them to specific species. |

Reaction thermochemistry data

Data compiled by: Hussein Y. Afeefy, Joel F. Liebman, and Stephen E. Stein
Individual Reactions
By formula: C8H18 = C8H18
Quantity | Value | Units | Method | Reference | Comment |
---|---|---|---|---|---|
ΔrH° | -3.1 ± 0.88 | kJ/mol | Ciso | Prosen and Rossini, 1945 | liquid phase; Calculated from ΔHc |

Gas phase thermochemistry data

Data compiled as indicated in comments:
ALS - Hussein Y. Afeefy, Joel F. Liebman, and Stephen E. Stein
GT - Glushko Thermocenter, Russian Academy of Sciences, Moscow
Quantity | Value | Units | Method | Reference | Comment |
---|---|---|---|---|---|
ΔfH°gas | -51.38 ± 0.30 | kcal/mol | Ccb | Prosen and Rossini, 1945 | ALS |
Constant pressure heat capacity of gas
Cp,gas (cal/mol*K) | Temperature (K) | Reference | Comment |
---|---|---|---|
30.590 | 200. | Scott D.W., 1974 | Recommended values were obtained from the consistent correlation scheme for alkanes [ Scott D.W., 1974, 2, Scott D.W., 1974]. This approach gives a good agreement with experimental data available for alkanes. However, large uncertainties could be expected at high temperatures.; GT |
41.420 | 273.15 | ||
44.93 ± 0.45 | 298.15 | ||
45.189 | 300. | ||
58.461 | 400. | ||
70.079 | 500. | ||
80.000 | 600. | ||
88.499 | 700. | ||
95.801 | 800. | ||
102.10 | 900. | ||
107.60 | 1000. | ||
112.40 | 1100. | ||
116.60 | 1200. | ||
120.00 | 1300. | ||
124.00 | 1400. | ||
127.00 | 1500. |
Constant pressure heat capacity of gas
Cp,gas (cal/mol*K) | Temperature (K) | Reference | Comment |
---|---|---|---|
59.099 | 403.3 | Barrow G.M., 1951 | GT |
65.901 | 462.6 | ||
72.600 | 521.7 |

Normal alkane RI, non-polar column, isothermal

Data compiled by: NIST Mass Spectrometry Data Center, William E. Wallace, director

Column type CapillaryCapillaryCapillaryCapillary
Active phase Methyl SiliconeSqualaneSqualaneSqualane
Column length (m) 74.6  150.
Carrier gas N2  He
Substrate
Column diameter (mm) 0.28  0.35
Phase thickness (μm)
Temperature (C) 50.100.70.86.
I 774.783.778.773.
ReferenceN/ADimov N., 1976Dimov N., 1976Vigdergauz and Martynov, 1971
Comment MSDC-RI MSDC-RI MSDC-RI MSDC-RI

Van Den Dool and Kratz RI, non-polar column, temperature ramp

Data compiled by: NIST Mass Spectrometry Data Center, William E. Wallace, director

Column type CapillaryCapillaryCapillaryCapillaryCapillary
Active phase Petrocol DHPetrocol DHPetrocol DHUltra-1Ultra-1
Column length (m) 50.100.100.50.50.
Carrier gas HeHeHeHeHe
Substrate
Column diameter (mm) 0.250.250.250.220.22
Phase thickness (μm) 0.50.50.50.330.33
Tstart (C) 35.30.30.-30.-30.
Tend (C) 200.220.220.240.240.
Heat rate (K/min) 3.1.1.1.2.
Initial hold (min) 10.
Final hold (min) 10.
I 768.4765.42766.763.06765.47
ReferenceCensullo, Jones, et al., 2003Subramaniam, Bochniak, et al., 1994White, Hackett, et al., 1992Haynes and Pitzer, 1985Haynes and Pitzer, 1985
Comment MSDC-RI MSDC-RI MSDC-RI MSDC-RI MSDC-RI
Column type CapillaryCapillaryCapillaryCapillaryCapillary
Active phase Ultra-1Ultra-2Ultra-2Ultra-2OV-101
Column length (m) 50.50.50.50.108.
Carrier gas HeHeHeHe
Substrate
Column diameter (mm) 0.220.220.220.220.25
Phase thickness (μm) 0.330.330.330.330.2
Tstart (C) -30.-30.-30.-30.35.
Tend (C) 240.240.240.240.200.
Heat rate (K/min) 3.1.2.3.1.
Initial hold (min)
Final hold (min)
I 766.94764.38766.76768.22764.
ReferenceHaynes and Pitzer, 1985Haynes and Pitzer, 1985Haynes and Pitzer, 1985Haynes and Pitzer, 1985Hayes and Pitzer, 1981
Comment MSDC-RI MSDC-RI MSDC-RI MSDC-RI MSDC-RI

Normal alkane RI, non-polar column, custom temperature program

Data compiled by: NIST Mass Spectrometry Data Center, William E. Wallace, director

Column type CapillaryCapillaryCapillaryCapillaryCapillary
Active phase Methyl SiliconeMethyl SiliconeOV-101Methyl SiliconeOV-101
Column length (m)
Carrier gas
Substrate
Column diameter (mm)
Phase thickness (μm)
Program not specifiednot specifiednot specifiednot specifiednot specified
I 781.774.776.766.765.
ReferenceChen and Feng, 2007Feng and Mu, 2007Du and Liang, 2003Spieksma, 1999Skrbic and Cvejanov, 1993
Comment MSDC-RI MSDC-RI MSDC-RI MSDC-RI MSDC-RI
Column type Capillary
Active phase OV-1, SE-30, Methyl silicone, SP-2100, OV-101, DB-1, etc.
Column length (m) 50.
Carrier gas Hydrogen
Substrate
Column diameter (mm) 0.32
Phase thickness (μm)
Program not specified
I 764.
ReferenceWaggott and Davies, 1984
Comment MSDC-RI

References

Prosen and Rossini, 1945
Prosen, E.J.; Rossini, F.D.,
Heats of combustion and formation of the paraffin hydrocarbons at 25° C,
J. Res. NBS, 1945, 263-267. [all data]
Daubert, 1996
Daubert, T.E.,
Vapor-Liquid Critical Properties of Elements and Compounds. 5. Branched Alkanes and Cycloalkanes,
J. Chem. Eng. Data, 1996, 41, 365-372. [all data]
Majer and Svoboda, 1985
Majer, V.; Svoboda, V.,
Enthalpies of Vaporization of Organic Compounds: A Critical Review and Data Compilation, Blackwell Scientific Publications, Oxford, 1985, 300. [all data]
McMicking and Kay, 1965
McMicking, J.H.; Kay, W.B.,
Vapor Pressures and Saturated Liquid and Vapor Densities of The Isomeric Heptanes and Isomeric Octanes,
Proc., Am. Pet. Inst., Sect. 3, 1965, 45, 75-90. [all data]
Reid, 1972
Reid, Robert C.,
Handbook on vapor pressure and heats of vaporization of hydrocarbons and related compounds, R. C. Wilhort and B. J. Zwolinski, Texas A Research Foundation. College Station, Texas(1971). 329 pages.$10.00,
AIChE J., 1972, 18, 6, 1278-1278, https://doi.org/10.1002/aic.690180637
. [all data]
Osborne and Ginnings, 1947
Osborne, Nathan S.; Ginnings, Defoe C.,
Measurements of heat of vaporization and heat capacity of a number of hydrocarbons,
J. RES. NATL. BUR. STAN., 1947, 39, 5, 453-17, https://doi.org/10.6028/jres.039.031
. [all data]
Osborne and Ginnings, 1947, 2
Osborne, N.S.; Ginnings, D.C.,
Measurements of heat of vaporization and heat capacity of a number of hydrocarbons,
J. Res. NBS, 1947, 39, 453-477. [all data]
Stephenson and Malanowski, 1987
Stephenson, Richard M.; Malanowski, Stanislaw,
Handbook of the Thermodynamics of Organic Compounds, 1987, https://doi.org/10.1007/978-94-009-3173-2
. [all data]
Willingham, Taylor, et al., 1945
Willingham, C.B.; Taylor, W.J.; Pignocco, J.M.; Rossini, F.D.,
Vapor pressures and boiling points of some paraffin, alkylcyclopentane, alkylcyclohexane, and alkylbenzene hydrocarbons,
J. RES. NATL. BUR. STAN., 1945, 35, 3, 219-17, https://doi.org/10.6028/jres.035.009
. [all data]
Stull, 1947
Stull, Daniel R.,
Vapor Pressure of Pure Substances. Organic and Inorganic Compounds,
Ind. Eng. Chem., 1947, 39, 4, 517-540, https://doi.org/10.1021/ie50448a022
. [all data]