1-Pentanol, 2-ethyl-4-methyl-
- Formula: C8H18O
- Molecular weight: 130.2279
- IUPAC Standard InChIKey: QCHSJPKDWOFACC-UHFFFAOYSA-N
- CAS Registry Number: 106-67-2
- Chemical structure:
View 3d structure (requires JavaScript / HTML 5) - Other names: 2-Ethyl-4-methylpentanol; 2-Ethylisohexanol; 2-Ethyl-4-methyl-1-pentanol; 2-ethyl-4-methylpentan-1-ol; 2-Methyl-1-heptanol

Phase change data

Data compiled as indicated in comments:
TRC - Thermodynamics Research Center, NIST Boulder Laboratories, Chris Muzny director
AC - William E. Acree, Jr., James S. Chickos
Quantity | Value | Units | Method | Reference | Comment |
---|---|---|---|---|---|
Tboil | 449.65 | K | N/A | Hagemeyer and Hudson, 1958 | Uncertainty assigned by TRC = 3. K; TRC |
Enthalpy of vaporization
ΔvapH (kJ/mol) | Temperature (K) | Method | Reference | Comment |
---|---|---|---|---|
53.3 | 365. | A | Stephenson and Malanowski, 1987 | Based on data from 350. to 449. K. See also Wilhoit and Zwolinski, 1973.; AC |
Antoine Equation Parameters
log10(P) = A − (B / (T + C))
P = vapor pressure (bar)
T = temperature (K)
View plot Requires a JavaScript / HTML 5 canvas capable browser.
Temperature (K) | A | B | C | Reference | Comment |
---|---|---|---|---|---|
343.18 to 449.54 | 4.05413 | 1326.147 | -122.631 | Dykyj, Seprakova, et al., 1961 | Coefficents calculated by NIST from author's data. |

References

Hagemeyer and Hudson, 1958
Hagemeyer, H.J.; Hudson, G.V.,
, 1958. [all data]
Stephenson and Malanowski, 1987
Stephenson, Richard M.; Malanowski, Stanislaw,
Handbook of the Thermodynamics of Organic Compounds, 1987, https://doi.org/10.1007/978-94-009-3173-2
. [all data]
Wilhoit and Zwolinski, 1973
Wilhoit, R.C.; Zwolinski, B.J.,
Physical and thermodynamic properties of aliphatic alcohols,
J. Phys. Chem. Ref. Data Suppl., 1973, 1, 2, 1. [all data]
Dykyj, Seprakova, et al., 1961
Dykyj, J.; Seprakova, M.; Paulech, J.,
Vapor Pressure of Two Alcohols C8 and Two Aldehydes C8,
Chem. Zvesti, 1961, 465-468. [all data]