Sn(Et)(Cl)3
- Formula: C2H5Cl3Sn
- Molecular weight: 254.130
- CAS Registry Number: 1066-57-5

Phase change data

Data compiled by: José A. Martinho Simões
Quantity | Value | Units | Method | Reference | Comment |
---|---|---|---|---|---|
ΔvapH° | 11.7 | kcal/mol | N/A | Dillard, McNeill, et al., 1958 |

Reaction thermochemistry data

Data compiled by: José A. Martinho Simões
Individual Reactions
(l) +
(l) = C2H5Cl3Sn (l) +
(l)
By formula: C8H20Sn (l) + Cl4Sn (l) = C2H5Cl3Sn (l) + C6H15ClSn (l)
Quantity | Value | Units | Method | Reference | Comment |
---|---|---|---|---|---|
ΔrH° | -22.6 ± 1.1 | kcal/mol | RSC and EST | Nash, Skinner, et al., 1965 |

References

Dillard, McNeill, et al., 1958
Dillard, C.R.; McNeill, E.H.; Simmons, D.E.; Yeldell, J.B.,
J. Am. Chem. Soc., 1958, 80, 3607. [all data]
Nash, Skinner, et al., 1965
Nash, G.A.; Skinner, H.A.; Stack, W.F.,
Trans. Faraday Soc., 1965, 61, 640. [all data]