bromotrimethylstannane
- Formula: C3H9BrSn
- Molecular weight: 243.718
- CAS Registry Number: 1066-44-0

Gas phase thermochemistry data

Data compiled by: José A. Martinho Simões
Quantity | Value | Units | Method | Reference | Comment |
---|---|---|---|---|---|
ΔfH°gas | -138.2 ± 5.6 | kJ/mol | Review | Martinho Simões | The enthalpy of formation relies on -49.7 ± 2.0 kJ/mol for the enthalpy of formation of Sn(Me)4(l). |
ΔfH°gas | -145.6 | kJ/mol | Review | Martinho Simões | The enthalpy of formation relies on -379.8 ± 4.1 kJ/mol for the enthalpy of formation of Sn(Me)3(OH)(cr). |

Condensed phase thermochemistry data

Data compiled by: José A. Martinho Simões
Quantity | Value | Units | Method | Reference | Comment |
---|---|---|---|---|---|
ΔfH°liquid | -185.5 ± 3.7 | kJ/mol | Review | Martinho Simões | The enthalpy of formation relies on -49.7 ± 2.0 kJ/mol for the enthalpy of formation of Sn(Me)4(l). |
Quantity | Value | Units | Method | Reference | Comment |
ΔfH°solid | -204.2 ± 4.1 | kJ/mol | Review | Martinho Simões | The enthalpy of formation relies on -379.8 ± 4.1 kJ/mol for the enthalpy of formation of Sn(Me)3(OH)(cr). |

Phase change data

Data compiled by: José A. Martinho Simões
Quantity | Value | Units | Method | Reference | Comment |
---|---|---|---|---|---|
ΔvapH° | 47.3 ± 4.2 | kJ/mol | RSC | Davies, Pope, et al., 1963 | |
Quantity | Value | Units | Method | Reference | Comment |
ΔsubH° | 58.6 | kJ/mol | RSC | Baldwin, Lappert, et al., 1972 |

Reaction thermochemistry data

Data compiled by: José A. Martinho Simões
Individual Reactions
(l) +
(g) =
(l) + C3H9BrSn (l)
By formula: C10H16Sn (l) + Br2 (g) = C7H7Br (l) + C3H9BrSn (l)
Quantity | Value | Units | Method | Reference | Comment |
---|---|---|---|---|---|
ΔrH° | -226.6 ± 0.9 | kJ/mol | RSC | Pedley and Skinner, 1959 | Please also see Pedley and Rylance, 1977 and Cox and Pilcher, 1970. |
(l) +
(g) = C3H9BrSn (l) +
(g)
By formula: C4H12Sn (l) + Br2 (g) = C3H9BrSn (l) + CH3Br (g)
Quantity | Value | Units | Method | Reference | Comment |
---|---|---|---|---|---|
ΔrH° | -202.1 ± 2.9 | kJ/mol | RSC | Pedley, Skinner, et al., 1957 | Please also see Pedley and Rylance, 1977 and Cox and Pilcher, 1970. |
By formula: C6H18Sn2 (l) + Br2 (l) = 2C3H9BrSn (l)
Quantity | Value | Units | Method | Reference | Comment |
---|---|---|---|---|---|
ΔrH° | -293.9 ± 2.1 | kJ/mol | RSC | Pedley, Skinner, et al., 1957 | Please also see Pedley and Rylance, 1977 and Cox and Pilcher, 1970. |
C3H9BrSn (cr) + (l) = (
• 55
) (solution) + C3H10OSn (cr)
By formula: C3H9BrSn (cr) + H2O (l) = (HBr • 55H2O) (solution) + C3H10OSn (cr)
Quantity | Value | Units | Method | Reference | Comment |
---|---|---|---|---|---|
ΔrH° | -10.0 ± 0.8 | kJ/mol | RSC | Baldwin, Lappert, et al., 1972 |

Gas phase ion energetics data

Data compiled as indicated in comments:
LLK - Sharon G. Lias, Rhoda D. Levin, and Sherif A. Kafafi
Ionization energy determinations
IE (eV) | Method | Reference | Comment |
---|---|---|---|
9.4 | PE | Flamini, Semprini, et al., 1976 | LLK |
9.60 | PE | Flamini, Semprini, et al., 1976 | Vertical value; LLK |

References

Martinho Simões
Martinho Simões, J.A.,
Private communication (see http://webbook.nist.gov/chemistry/om/). [all data]
Davies, Pope, et al., 1963
Davies, J.V.; Pope, A.E.; Skinner, H.A.,
Thermochemistry of metallic alkyls. Part 10.?Heats of combustion of some tetra-alkyls of tin,
Trans. Faraday Soc., 1963, 59, 2233, https://doi.org/10.1039/tf9635902233
. [all data]
Baldwin, Lappert, et al., 1972
Baldwin, J.C.; Lappert, M.F.; Pedley, J.B.; Poland, J.S.,
J. Chem. Soc., Dalton Trans., 1972, 1943.. [all data]
Pedley and Skinner, 1959
Pedley, J.B.; Skinner, H.A.,
Thermochemistry of metallic alkyls. Part 9.?Heats of bromination of some organo-tin compounds,
Trans. Faraday Soc., 1959, 55, 544, https://doi.org/10.1039/tf9595500544
. [all data]
Pedley and Rylance, 1977
Pedley, J.B.; Rylance, J.,
Computer Analysed Thermochemical Data: Organic and Organometallic Compounds, University of Sussex, Brigton, 1977. [all data]
Cox and Pilcher, 1970
Cox, J.D.; Pilcher, G.,
Thermochemistry of Organic and Organometallic Compounds
in Academic Press, New York, 1970. [all data]
Pedley, Skinner, et al., 1957
Pedley, J.B.; Skinner, H.A.; Chernick, C.L.,
Thermochemistry of metallic alkyls. Part 8.?Tin tetramethyl, and hexamethyl distannane,
Trans. Faraday Soc., 1957, 53, 1612, https://doi.org/10.1039/tf9575301612
. [all data]