Silanol, trimethyl-
- Formula: C3H10OSi
- Molecular weight: 90.1964
- IUPAC Standard InChIKey: AAPLIUHOKVUFCC-UHFFFAOYSA-N
- CAS Registry Number: 1066-40-6
- Chemical structure:
View 3d structure (requires JavaScript / HTML 5) - Other names: Hydroxytrimethylsilane; Trimethylhydroxysilane; Trimethylsilanol

Phase change data

Data compiled as indicated in comments:
AC - William E. Acree, Jr., James S. Chickos
Enthalpy of vaporization
ΔvapH (kJ/mol) | Temperature (K) | Method | Reference | Comment |
---|---|---|---|---|
46.8 | 306. | A | Stephenson and Malanowski, 1987 | Based on data from 291. to 357. K.; AC |
44.2 | 324. | I | Grubb and Osthoff, 1953 | Based on data from 291. to 358. K.; AC |
Antoine Equation Parameters
log10(P) = A − (B / (T + C))
P = vapor pressure (bar)
T = temperature (K)
View plot Requires a JavaScript / HTML 5 canvas capable browser.
Temperature (K) | A | B | C | Reference | Comment |
---|---|---|---|---|---|
291. to 357.8 | 5.44591 | 1767.766 | -44.888 | Grubb and Osthoff, 1953 | Coefficents calculated by NIST from author's data. |

Reaction thermochemistry data

Data compiled by: John E. Bartmess
Individual Reactions
C3H9OSi- + =
By formula: C3H9OSi- + H+ = C3H10OSi
Quantity | Value | Units | Method | Reference | Comment |
---|---|---|---|---|---|
ΔrH° | 1518. ± 19. | kJ/mol | G+TS | Angelini, Johnson, et al., 1991 | gas phase; Between CF2HCH2OH, CF3CH2OH |
ΔrH° | 1502. ± 17. | kJ/mol | G+TS | Damrauer, Simon, et al., 1991 | gas phase; between pyrrole, CF3CH2OH |
Quantity | Value | Units | Method | Reference | Comment |
ΔrG° | 1492. ± 19. | kJ/mol | IMRB | Angelini, Johnson, et al., 1991 | gas phase; Between CF2HCH2OH, CF3CH2OH |
ΔrG° | 1475. ± 17. | kJ/mol | IMRB | Damrauer, Simon, et al., 1991 | gas phase; between pyrrole, CF3CH2OH |

Gas phase ion energetics data

Data evaluated as indicated in comments:
HL - Edward P. Hunter and Sharon G. Lias
Data compiled as indicated in comments:
B - John E. Bartmess
Quantity | Value | Units | Method | Reference | Comment |
---|---|---|---|---|---|
Proton affinity (review) | 814.0 | kJ/mol | N/A | Hunter and Lias, 1998 | HL |
Quantity | Value | Units | Method | Reference | Comment |
Gas basicity | 781.5 | kJ/mol | N/A | Hunter and Lias, 1998 | HL |
De-protonation reactions
C3H9OSi- + =
By formula: C3H9OSi- + H+ = C3H10OSi
Quantity | Value | Units | Method | Reference | Comment |
---|---|---|---|---|---|
ΔrH° | 1518. ± 19. | kJ/mol | G+TS | Angelini, Johnson, et al., 1991 | gas phase; Between CF2HCH2OH, CF3CH2OH; B |
ΔrH° | 1502. ± 17. | kJ/mol | G+TS | Damrauer, Simon, et al., 1991 | gas phase; between pyrrole, CF3CH2OH; B |
Quantity | Value | Units | Method | Reference | Comment |
ΔrG° | 1492. ± 19. | kJ/mol | IMRB | Angelini, Johnson, et al., 1991 | gas phase; Between CF2HCH2OH, CF3CH2OH; B |
ΔrG° | 1475. ± 17. | kJ/mol | IMRB | Damrauer, Simon, et al., 1991 | gas phase; between pyrrole, CF3CH2OH; B |

Normal alkane RI, non-polar column, temperature ramp

Column type | Active phase | I | Reference | Comment |
---|---|---|---|---|
Capillary | OV-101 | 584. | Zenkevich, 2005 | 25. m/0.20 mm/0.10 μm, N2/He, 6. K/min; Tstart: 50. C; Tend: 250. C |

Normal alkane RI, non-polar column, custom temperature program

Column type | Active phase | I | Reference | Comment |
---|---|---|---|---|
Capillary | DB-1 | 567. | Ciccioli, Cecinato, et al., 1994 | 60. m/0.32 mm/0.25 μm; Program: not specified |

References

Stephenson and Malanowski, 1987
Stephenson, Richard M.; Malanowski, Stanislaw,
Handbook of the Thermodynamics of Organic Compounds, 1987, https://doi.org/10.1007/978-94-009-3173-2
. [all data]
Grubb and Osthoff, 1953
Grubb, Willard T.; Osthoff, Robert C.,
Physical Properties of Organosilicon Compounds. II. Trimethylsilanol and Triethylsilanol,
J. Am. Chem. Soc., 1953, 75, 9, 2230-2232, https://doi.org/10.1021/ja01105a061
. [all data]
Angelini, Johnson, et al., 1991
Angelini, G.; Johnson, C.E.; Brauman, J.I.,
Addition and Deprotonation in Reactions of Hydroxide Ion with a beta-Hydroxysilane,
Int. J. Mass Spectrom. Ion Proc., 1991, 109, 1, https://doi.org/10.1016/0168-1176(91)85093-2
. [all data]
Damrauer, Simon, et al., 1991
Damrauer, R.; Simon, R.; Krempp, M.,
Effect of Substituents on the Gas-Phase Acidity of Silanols,
J. Am. Chem. Soc., 1991, 113, 12, 4431, https://doi.org/10.1021/ja00012a009
. [all data]
Hunter and Lias, 1998
Hunter, E.P.; Lias, S.G.,
Evaluated Gas Phase Basicities and Proton Affinities of Molecules: An Update,
J. Phys. Chem. Ref. Data, 1998, 27, 3, 413-656, https://doi.org/10.1063/1.556018
. [all data]
Zenkevich, 2005
Zenkevich, I.G.,
Experimentally measured retention indices., 2005. [all data]
Ciccioli, Cecinato, et al., 1994
Ciccioli, P.; Cecinato, A.; Brancaleoni, E.; Brachetti, A.; Frattoni, M.; Sparapani, R.,
Composition and Distribution of Polar and Non-Polar VOCs in Urban, Rural, Forest and Remote Areas,
Eur Commission EUR, 1994, 549-568. [all data]