Isobutyl acrylate
- Formula: C7H12O2
- Molecular weight: 128.1690
- IUPAC Standard InChIKey: CFVWNXQPGQOHRJ-UHFFFAOYSA-N
- CAS Registry Number: 106-63-8
- Chemical structure:
View 3d structure (requires JavaScript / HTML 5) - Other names: 2-Propenoic acid, 2-methylpropyl ester; Acrylic acid, isobutyl ester; Isobutyl 2-propenoate; 2-Methylpropyl acrylate; Isobutyl propenoate; Isobutylester kyseliny akrylove; NSC 20949

Phase change data

Data compiled as indicated in comments:
BS - Robert L. Brown and Stephen E. Stein
TRC - Thermodynamics Research Center, NIST Boulder Laboratories, Chris Muzny director
AC - William E. Acree, Jr., James S. Chickos
Quantity | Value | Units | Method | Reference | Comment |
---|---|---|---|---|---|
Tboil | 405.2 | K | N/A | Weast and Grasselli, 1989 | BS |
Tboil | 405. | K | N/A | Ipatov, 1940 | Uncertainty assigned by TRC = 5. K; TRC |
Quantity | Value | Units | Method | Reference | Comment |
Tfus | 212.1 | K | N/A | Anonymous, 1958 | Uncertainty assigned by TRC = 0.6 K; TRC |
Enthalpy of vaporization
ΔvapH (kJ/mol) | Temperature (K) | Method | Reference | Comment |
---|---|---|---|---|
43.8 | 345. | A | Stephenson and Malanowski, 1987 | Based on data from 330. to 410. K.; AC |

Kovats' RI, non-polar column, isothermal

Column type | Active phase | Temperature (C) | I | Reference | Comment |
---|---|---|---|---|---|
Capillary | OV-101 | 100. | 836. | Horna, Táborský, et al., 1985 | N2; Column length: 19. m; Column diameter: 0.28 mm |
Capillary | OV-101 | 120. | 836. | Horna, Táborský, et al., 1985, 2 | N2; Column length: 19. m; Column diameter: 0.28 mm |
Capillary | OV-101 | 80. | 838. | Horna, Táborský, et al., 1985, 2 | N2; Column length: 19. m; Column diameter: 0.28 mm |
Packed | SE-30 | 100. | 835. | Winskowski, 1983 | Gaschrom Q; Column length: 2. m |

Kovats' RI, polar column, isothermal

Column type | Active phase | Temperature (C) | I | Reference | Comment |
---|---|---|---|---|---|
Capillary | SP-1000 | 100. | 1114. | Horna, Táborský, et al., 1985 | N2; Column length: 46. m; Column diameter: 0.23 mm |
Capillary | SP-1000 | 120. | 1115. | Horna, Táborský, et al., 1985, 2 | N2; Column length: 46. m; Column diameter: 0.23 mm |
Capillary | SP-1000 | 80. | 1109. | Horna, Táborský, et al., 1985, 2 | N2; Column length: 46. m; Column diameter: 0.23 mm |

Normal alkane RI, polar column, custom temperature program

Column type | Active phase | I | Reference | Comment |
---|---|---|---|---|
Capillary | Carbowax 20M | 1107. | Vinogradov, 2004 | Program: not specified |

References

Weast and Grasselli, 1989
CRC Handbook of Data on Organic Compounds, 2nd Editon, Weast,R.C and Grasselli, J.G., ed(s)., CRC Press, Inc., Boca Raton, FL, 1989, 1. [all data]
Ipatov, 1940
Ipatov, A.V.,
Isopropyl and Butyl Esters of Acrylic Acid,
J. Gen. Chem. U.S.S.R., 1940, 10, 866. [all data]
Anonymous, 1958
Anonymous, R.,
, Am. Pet. Inst. Res. Proj. 45, Ohio State Univ., 1958. [all data]
Stephenson and Malanowski, 1987
Stephenson, Richard M.; Malanowski, Stanislaw,
Handbook of the Thermodynamics of Organic Compounds, 1987, https://doi.org/10.1007/978-94-009-3173-2
. [all data]
Horna, Táborský, et al., 1985
Horna, A.; Táborský, J.; Churácek, J.; Dufka, O.,
Chromatography of monomers. IV. Gas-liquid chromatographic studies of C1-C6 n-alkyl and C3-C6 isoalkyl acrylates and their hydrogen halide and halogen addition derivatives,
J. Chromatogr., 1985, 348, 141-149, https://doi.org/10.1016/S0021-9673(01)92447-1
. [all data]
Horna, Táborský, et al., 1985, 2
Horna, A.; Táborský, J.; Dufka, O.; Matousek, P.; Churácek, J.,
Chromatography of monomers. II. Glass capillary gas chromatography of C1-C18 alkyl esters of acrylic and methacrylic acids,
J. Chromatogr., 1985, 325, 367-378, https://doi.org/10.1016/S0021-9673(00)96047-3
. [all data]
Winskowski, 1983
Winskowski, J.,
Gaschromatographische Identifizierung von Stoffen anhand von Indexziffem und unterschiedlichen Detektoren,
Chromatographia, 1983, 17, 3, 160-165, https://doi.org/10.1007/BF02271041
. [all data]
Vinogradov, 2004
Vinogradov, B.A.,
Production, composition, properties and application of essential oils, 2004, retrieved from http://viness.narod.ru. [all data]