1,2,3-Propanetriol, 1-acetate
- Formula: C5H10O4
- Molecular weight: 134.1305
- IUPAC Standard InChIKey: KMZHZAAOEWVPSE-UHFFFAOYSA-N
- CAS Registry Number: 106-61-6
- Chemical structure:
View 3d structure (requires JavaScript / HTML 5) - Species with the same structure:
- Other names: Acetin, 1-mono-; α-Monoacetin; Glycerol α-monoacetate; 1-Monoacetin; 2,3-Dihydroxypropyl acetate; Glycerol 1-acetate; Glycerol 1-monoacetate; (.+/-.)-2,3-Dihydroxypropyl acetate; Glycerine 1-acetate; Glyceryl 1-monoacetate; NSC 35010; 93713-40-7; Acetin; Acetic acid, monoglyceride; Monoacetyl glycerine; 1,2,3,-Propanetriol monoacetate; Monoacetin; Monacetin; Glyceryl monoacetate; Glyceryl acetate; Glycerol monoacetate; 1-Acetoxy-2,3-dihydroxypropane

Phase change data

Data compiled by: William E. Acree, Jr., James S. Chickos
Enthalpy of vaporization
ΔvapH (kJ/mol) | Temperature (K) | Method | Reference | Comment |
---|---|---|---|---|
74.0 | 400. | A | Stephenson and Malanowski, 1987 | Based on data from 385. to 458. K. See also Dykyj, 1972. |

Van Den Dool and Kratz RI, non-polar column, custom temperature program

Column type | Active phase | I | Reference | Comment |
---|---|---|---|---|
Capillary | HP-5MS | 1095.2 | Andriamaharavo, 2014 | 30. m/0.25 mm/0.25 μm, He; Program: 60C (1 min) => 5 C/min => 210C => 10 C/min => 280C (15 min) |

Normal alkane RI, non-polar column, temperature ramp

Column type | Active phase | I | Reference | Comment |
---|---|---|---|---|
Capillary | DP-5 | 1091. | Vijayakumar, Duraipandiyan, et al., 2012 | 30. m/0.25 mm/0.25 μm, Helium, 80. C @ 1. min, 4. K/min, 300. C @ 40. min |

References

Stephenson and Malanowski, 1987
Stephenson, Richard M.; Malanowski, Stanislaw,
Handbook of the Thermodynamics of Organic Compounds, 1987, https://doi.org/10.1007/978-94-009-3173-2
. [all data]
Dykyj, 1972
Dykyj, J.,
Petrochemia, 1972, 12, 1, 13. [all data]
Andriamaharavo, 2014
Andriamaharavo, N.R.,
Retention Data. NIST Mass Spectrometry Data Center., NIST Mass Spectrometry Data Center, 2014. [all data]
Vijayakumar, Duraipandiyan, et al., 2012
Vijayakumar, A.; Duraipandiyan, V.; Jeyarai, B.; Agastian, P.; Raj, M.K.; Ignacimunthu, S.,
Phytochemical analysis and in vitro antimicrobial activity of Illicium griffithii Hook f. Thoms extracts,
Asian Pacific J. Tropical Diseases, 2012, 2, 3, 190-199, https://doi.org/10.1016/S2222-1808(12)60045-0
. [all data]