2,5-Piperazinedione
- Formula: C4H6N2O2
- Molecular weight: 114.1026
- IUPAC Standard InChIKey: BXRNXXXXHLBUKK-UHFFFAOYSA-N
- CAS Registry Number: 106-57-0
- Chemical structure:
View 3d structure (requires JavaScript / HTML 5) - Other names: Cyclo(glycylglycyl); Cyclic(glycylglycyl); α,γ-Diacipiperazine; Cyclodiglycine; Cycloglycylglycine; Diglycolyl diamide; Diketopiperazine; Glycine, bimol. cyclic peptide; Glycine, N-glycyl-, cyclic peptide; Glycylglycine lactam; 2,5-Diketopiperazine; 2,5-Dioxopiperazine; Piperazine-2,5-dione; NSC 26345

Condensed phase thermochemistry data

Data compiled as indicated in comments:
ALS - Hussein Y. Afeefy, Joel F. Liebman, and Stephen E. Stein
DH - Eugene S. Domalski and Elizabeth D. Hearing
Quantity | Value | Units | Method | Reference | Comment |
---|---|---|---|---|---|
ΔfH°solid | -446. ± 1.3 | kJ/mol | Ccb | Lebedev, Kulagina, et al., 1982 | see Lebedev, Kulagina, et al., 1981; ALS |
Quantity | Value | Units | Method | Reference | Comment |
ΔcH°solid | -1985. ± 1.3 | kJ/mol | Ccb | Lebedev, Kulagina, et al., 1982 | see Lebedev, Kulagina, et al., 1981; ALS |
ΔcH°solid | -1990.1 ± 0.2 | kJ/mol | Ccb | Wrede, 1911 | ALS |
ΔcH°solid | -1993. | kJ/mol | Ccb | Fischer and Wrede, 1904 | Heat of combustion corrected for pressure; ALS |
ΔcH°solid | -1992.0 | kJ/mol | Ccb | Lemoult, 1904 | ALS |
Quantity | Value | Units | Method | Reference | Comment |
S°solid,1 bar | 145.5 | J/mol*K | N/A | Lebedev, Kulagina, et al., 1982, 2 | DH |
S°solid,1 bar | 145.6 | J/mol*K | N/A | Lebedev, Kulagina, et al., 1981, 2 | DH |
Constant pressure heat capacity of solid
Cp,solid (J/mol*K) | Temperature (K) | Reference | Comment |
---|---|---|---|
134.0 | 298.15 | Lebedev, Kulagina, et al., 1982, 2 | T = 8 to 330 K.; DH |
133.9 | 298.15 | Lebedev, Kulagina, et al., 1981, 2 | T = 5 to 330 K.; DH |

Phase change data

Data compiled by: William E. Acree, Jr., James S. Chickos
Enthalpy of sublimation
ΔsubH (kJ/mol) | Temperature (K) | Method | Reference | Comment |
---|---|---|---|---|
103.8 | 428. | A | Stephenson and Malanowski, 1987 | Based on data from 413. to 450. K. |

Reaction thermochemistry data

Data compiled by: Robert C. Dunbar
Individual Reactions
By formula: Na+ + C4H6N2O2 = (Na+ • C4H6N2O2)
Quantity | Value | Units | Method | Reference | Comment |
---|---|---|---|---|---|
ΔrH° | 143. ± 7.1 | kJ/mol | CIDC | Cerda, Hoyau, et al., 1998 |

Ion clustering data

Data compiled by: Robert C. Dunbar
Clustering reactions
By formula: Na+ + C4H6N2O2 = (Na+ • C4H6N2O2)
Quantity | Value | Units | Method | Reference | Comment |
---|---|---|---|---|---|
ΔrH° | 143. ± 7.1 | kJ/mol | CIDC | Cerda, Hoyau, et al., 1998 |

References

Lebedev, Kulagina, et al., 1982
Lebedev, B.V.; Kulagina, T.G.; Kiparisova, E.G.,
Thermodynamics of dl-lactide, ethylene oxalate, and 2,5-dioxopiperazine in the range 0-330 K.,
Russ. J. Phys. Chem. (Engl. Transl.), 1982, 56, 1641-1643. [all data]
Lebedev, Kulagina, et al., 1981
Lebedev, B.V.; Kulagina, T.G.; Kiparisova, E.G.,
Thermodynamics of 2,5-piperazinedione in the range 0-330 K,
J. Gen. Chem. USSR, 1981, 51, 174-177. [all data]
Wrede, 1911
Wrede, F.,
Uber die Bestimmung von Berbrennungswarmen mittels der kalorimetrischen Bombe unter Benutzung des Platinwiderstandsthermometers,
Z. Phys. Chem. (Leipzig), 1911, 81-94. [all data]
Fischer and Wrede, 1904
Fischer, E.; Wrede, F.,
Uber die Verbrennungswarme einiger organischer Verbindungen,
Sitzungsber. Dtsch. Akad. Wiss. Berlin Kl. Math. Phys. Tech., 1904, 687-715. [all data]
Lemoult, 1904
Lemoult, M.P.,
Remarques sur une serie recenie de determinations calorimetriques,
Compt. Rend., 1904, 663-635. [all data]
Lebedev, Kulagina, et al., 1982, 2
Lebedev, B.V.; Kulagina, T.G.; Kiparisova, Y.G.,
Thermodynamics of dl-lactide, ethylene oxalate, and 2,5-dioxopiperazine in the range 0-330 K,
Zhur. Fiz. Khim., 1982, 56, 2665-2669. [all data]
Lebedev, Kulagina, et al., 1981, 2
Lebedev, B.V.; Kulagina, T.G.; Kiparisova, Y.G.,
Thermodynamics of 2,5-diketopiperazine in the 0-330K range,
Zhur. Obshch. Khim., 1981, 51, 199-203. [all data]
Stephenson and Malanowski, 1987
Stephenson, Richard M.; Malanowski, Stanislaw,
Handbook of the Thermodynamics of Organic Compounds, 1987, https://doi.org/10.1007/978-94-009-3173-2
. [all data]
Cerda, Hoyau, et al., 1998
Cerda, B.A.; Hoyau, S.; Ohanessian, G.; Wesdemiotis, C.,
PAs of Peptides,
J. Am. Chem. Soc., 1998, 120, 2437. [all data]