4-Hydroxy-N-methylpiperidine
- Formula: C6H13NO
- Molecular weight: 115.1735
- IUPAC Standard InChIKey: BAUWRHPMUVYFOD-UHFFFAOYSA-N
- CAS Registry Number: 106-52-5
- Chemical structure:
View 3d structure (requires JavaScript / HTML 5) - Other names: 1-Methyl-4-hydroxypiperidine; 4-Hydroxy-1-methylpiperidine; 1-Methylpiperidinol-(4); 1-Methyl-4-piperidinol; 4-Piperidinol, 1-methyl-; N-Methyl-4-hydroxypiperidine; N-Methyl-4-piperidinol; N-Methylpiperidol; NSC 60705; 1-methylpiperidin-4-ol

Phase change data

Data compiled as indicated in comments:
BS - Robert L. Brown and Stephen E. Stein
AC - William E. Acree, Jr., James S. Chickos
Quantity | Value | Units | Method | Reference | Comment |
---|---|---|---|---|---|
Tboil | 473.2 | K | N/A | Weast and Grasselli, 1989 | BS |
Quantity | Value | Units | Method | Reference | Comment |
ΔvapH° | 80.8 ± 0.4 | kJ/mol | C | Ribeiro da Silva and Cabral, 2006 | AC |

Van Den Dool and Kratz RI, non-polar column, temperature ramp

Column type | Active phase | I | Reference | Comment |
---|---|---|---|---|
Capillary | SE-54 | 988. | Kostiainen, 2000 | 25. m/0.32 mm/0.25 μm, He, 40. C @ 1. min, 10. K/min, 280. C @ 10. min |

References

Weast and Grasselli, 1989
CRC Handbook of Data on Organic Compounds, 2nd Editon, Weast,R.C and Grasselli, J.G., ed(s)., CRC Press, Inc., Boca Raton, FL, 1989, 1. [all data]
Ribeiro da Silva and Cabral, 2006
Ribeiro da Silva, Manuel A.V.; Cabral, Joana I.T.A.,
Experimental Study on the Thermochemistry of Some Derivatives of Piperidinol,
J. Chem. Eng. Data, 2006, 51, 2, 767-771, https://doi.org/10.1021/je050508n
. [all data]