Butanedioic acid, ethyl phenylmethyl ester
- Formula: C13H16O4
- Molecular weight: 236.2637
- IUPAC Standard InChIKey: MGWTXNMQOXXVRU-UHFFFAOYSA-N
- CAS Registry Number: 106478-00-6
- Chemical structure:
View 3d structure (requires JavaScript / HTML 5) - Other names: Ethyl benzyl succinate

Van Den Dool and Kratz RI, non-polar column, temperature ramp

Column type | Active phase | I | Reference | Comment |
---|---|---|---|---|
Packed | OV-101 | 1740. | Dziwinski and Hetper, 1988 | N2, Gas-Chrom Q (80-100 mesh), 12. K/min; Column length: 0.8 m; Tstart: 150. C; Tend: 300. C |

References

Dziwinski and Hetper, 1988
Dziwinski, E.; Hetper, J.,
Gas Chromatography-Mass Spectrometry of C1-C10 Alkyl Benzyl Succinates,
J. Chromatogr., 1988, 446, 103-108, https://doi.org/10.1016/S0021-9673(00)94422-4
. [all data]