Si4 anion
- Formula: Si4-
- Molecular weight: 112.3425
- CAS Registry Number: 106389-61-1

Gas phase thermochemistry data

Data compiled by: John E. Bartmess
Quantity | Value | Units | Method | Reference | Comment |
---|---|---|---|---|---|
ΔfH°gas | 470. ± 23. | kJ/mol | R-EA | Nakajima, Taguwa, et al., 1995 | Vertical Detachment Energy: 2.15±0.04 eV. |

Ion clustering data

Data compiled by: John E. Bartmess
Clustering reactions
By formula: (Si4- • 4294967295Si) + Si = Si4-
Quantity | Value | Units | Method | Reference | Comment |
---|---|---|---|---|---|
ΔrH° | 411. ± 29. | kJ/mol | N/A | Nakajima, Taguwa, et al., 1995 | gas phase; Vertical Detachment Energy: 2.15±0.04 eV. |

Reaction thermochemistry data

Data compiled by: John E. Bartmess

Individual Reactions

(Si4- • 4294967295silicon) + silicon = Si4-

By formula: (Si4- • 4294967295Si) + Si = Si4-

Quantity Value Units Method Reference Comment
Δr98.2 ± 6.9kcal/molN/ANakajima, Taguwa, et al., 1995gas phase; Vertical Detachment Energy: 2.15±0.04 eV.

References

Nakajima, Taguwa, et al., 1995
Nakajima, A.; Taguwa, T.; Nakao, K.; Gomei, M.; Kishi, R.; Iwata, S.; Kaya, K.,
Photoelectron Spectroscopy of silicon-carbon cluster Anions (SinCm-),
J. Chem. Phys., 1995, 103, 6, 2050, https://doi.org/10.1063/1.469731
. [all data]