quinhydrone
- Formula: C12H10O4
- Molecular weight: 218.2054
- IUPAC Standard InChIKey: BDJXVNRFAQSMAA-UHFFFAOYSA-N
- CAS Registry Number: 106-34-3
- Chemical structure:
View 3d structure (requires JavaScript / HTML 5) - Permanent link for this species. Use this link for bookmarking this species for future reference.

Condensed phase thermochemistry data

Data compiled by: Eugene S. Domalski and Elizabeth D. Hearing
Constant pressure heat capacity of solid
Cp,solid (J/mol*K) | Temperature (K) | Reference | Comment |
---|---|---|---|
228.4 | 243.4 | Lange, 1924 | T = 20 to 244 K. Value is unsmoothed experimental datum. |

References

Lange, 1924
Lange, F.,
Untersuchungen über die spezifische Wärme bei tiefen Temperaturen,
Z. Phys. Chem., 1924, 110, 343-362. [all data]