Butanoic acid, anhydride
- Formula: C8H14O3
- Molecular weight: 158.1950
- IUPAC Standard InChIKey: YHASWHZGWUONAO-UHFFFAOYSA-N
- CAS Registry Number: 106-31-0
- Chemical structure:
View 3d structure (requires JavaScript / HTML 5) - Other names: Butyric anhydride; n-Butyric acid anhydride; n-Butyric anhydride; Butanoic anhydride; Butyric acid anhydride; Butyryl oxide; n-Butanoic anhydride; Anhydrid kyseliny maselne; Butyranhydrid; UN 2739; Butanoic acid, 1,1'-anhydride

Phase change data

Data compiled as indicated in comments:
TRC - Thermodynamics Research Center, NIST Boulder Laboratories, Chris Muzny director
BS - Robert L. Brown and Stephen E. Stein
AC - William E. Acree, Jr., James S. Chickos
Quantity | Value | Units | Method | Reference | Comment |
---|---|---|---|---|---|
Tboil | 471.4 | K | N/A | Wright, 1961 | Uncertainty assigned by TRC = 0.6 K; TRC |
Tboil | 471. | K | N/A | Wright, 1960 | Uncertainty assigned by TRC = 0.5 K; TRC |
Tboil | 464.15 | K | N/A | Levi and Nicholls, 1958 | Uncertainty assigned by TRC = 2.5 K; TRC |
Tboil | 471.35 | K | N/A | Timmermans and Mattaar, 1921 | Uncertainty assigned by TRC = 0.5 K; TRC |
Quantity | Value | Units | Method | Reference | Comment |
Tfus | 198.15 | K | N/A | Timmermans and Mattaar, 1921 | Uncertainty assigned by TRC = 0.6 K; TRC |
Reduced pressure boiling point
Tboil (K) | Pressure (bar) | Reference | Comment |
---|---|---|---|
471.7 | 1.02 | Aldrich Chemical Company Inc., 1990 | BS |
Enthalpy of vaporization
ΔvapH (kJ/mol) | Temperature (K) | Method | Reference | Comment |
---|---|---|---|---|
49.1 | 364. | A | Stephenson and Malanowski, 1987 | Based on data from 349. to 470. K.; AC |

References

Wright, 1961
Wright, F.J.,
Influence of temperature on viscosity of nonassociated liquids,
J. Chem. Eng. Data, 1961, 6, 454. [all data]
Wright, 1960
Wright, F.J.,
Latent Heat of Vaporization and Composition,
Recl. Trav. Chim. Pays-Bas, 1960, 79, 784-9. [all data]
Levi and Nicholls, 1958
Levi, L.; Nicholls, R.V.V.,
Formation of Styrene by Pyrolysis of Aromatic Heterocyclic Aldehyde- Aliphatic Acid Anhydride Mixtures on Morden Bentonite,
Ind. Eng. Chem., 1958, 50, 1005. [all data]
Timmermans and Mattaar, 1921
Timmermans, J.; Mattaar, J.F.,
Freezing points of orgainic substances VI. New experimental determinations.,
Bull. Soc. Chim. Belg., 1921, 30, 213. [all data]
Aldrich Chemical Company Inc., 1990
Aldrich Chemical Company Inc.,
Catalog Handbook of Fine Chemicals, Aldrich Chemical Company, Inc., Milwaukee WI, 1990, 1. [all data]
Stephenson and Malanowski, 1987
Stephenson, Richard M.; Malanowski, Stanislaw,
Handbook of the Thermodynamics of Organic Compounds, 1987, https://doi.org/10.1007/978-94-009-3173-2
. [all data]