2,6-Octadienal, 3,7-dimethyl-, (Z)-
- Formula: C10H16O
- Molecular weight: 152.2334
- IUPAC Standard InChIKey: WTEVQBCEXWBHNA-YFHOEESVSA-N
- CAS Registry Number: 106-26-3
- Chemical structure:
View 3d structure (requires JavaScript / HTML 5) - Stereoisomers:
- Other names: β-Citral; cis-Citral; cis-3,7-Dimethyl-2,6-octadienal; beta-Citral; Neral; Z-Citral; (Z)-3,7-Dimethyl-2,6-octadienal; Citral B; (2Z)-3,7-Dimethyl-2,6-octadienal; 2,6-Octadienal, 3,7-dimethyl-, (2Z)-; (Z)-Neral; Neroli aldehyde; (Z)-3,7-Dimethylocta-2,6-dienal; Z-Citral (neral)

Phase change data

Data compiled by: William E. Acree, Jr., James S. Chickos
Quantity | Value | Units | Method | Reference | Comment |
---|---|---|---|---|---|
ΔvapH° | 60.2 | kJ/mol | GC | Hoskovec, Grygarová, et al., 2005 | Based on data from 343. to 453. K. |

Normal alkane RI, polar column, temperature ramp

Data compiled by: NIST Mass Spectrometry Data Center, William E. Wallace, director

Column type CapillaryCapillaryCapillaryCapillaryCapillary
Active phase HP-InnowaxBP-20BP-20InnowaxCarbowax
Column length (m) 30. 50.30.60.
Carrier gas HeliumNitrogenHeliumHeliumHe
Substrate
Column diameter (mm) 0.25 0.220.250.2
Phase thickness (μm) 0.25 0.250.250.25
Tstart (C) 50.60.60.40.60.
Tend (C) 250.200.220.250.250.
Heat rate (K/min) 5.5.2.6.2.
Initial hold (min) 5.  1.8.
Final hold (min) 10. 20.4.15.
I 1694.1676.1691.1690.1670.
ReferenceMenichini, Tundis, et al., 2011Mishra, Chaudhary, et al., 2010Ottavioli, Bighelli, et al., 2009Seo, Kim, et al., 2009Ferhat, Meklati, et al., 2007
Comment MSDC-RI MSDC-RI MSDC-RI MSDC-RI MSDC-RI
Column type CapillaryCapillaryCapillaryCapillaryCapillary
Active phase CarbowaxPEG-20MSupelcowax-10CP-Wax 52CBDB-Wax
Column length (m) 60.60.30.30.60.
Carrier gas HeHe He
Substrate
Column diameter (mm) 0.20.250.250.320.25
Phase thickness (μm) 0.250.250.250.250.25
Tstart (C) 60.90.40.60.70.
Tend (C) 250.225.250.220.230.
Heat rate (K/min) 2.3.2.3.32.
Initial hold (min) 8.  7.2.
Final hold (min) 15.15.33.3.20.
I 1647.1685.1688.1678.1679.
ReferenceFerhat, Tigrine-Kordjani, et al., 2007Gil A., Van Baren C.M., et al., 2007Sylvestre, Pichette, et al., 2007Hymete, Rohloff, et al., 2006Lan Phi N.T., Nishiyama C., et al., 2006
Comment MSDC-RI MSDC-RI MSDC-RI MSDC-RI MSDC-RI
Column type CapillaryCapillaryCapillaryCapillaryCapillary
Active phase DB-WaxDB-WaxNB-20MDB-WaxCarbowax-PEG
Column length (m) 60.25.30.60.60.
Carrier gas  HeHe Helium
Substrate
Column diameter (mm) 0.250.250.20.250.20
Phase thickness (μm) 0.250.250.250.250.25
Tstart (C) 70.100.50.70.60.
Tend (C) 230.250.250.230.250.
Heat rate (K/min) 2.8.2.2.2.
Initial hold (min) 2.  2.8.
Final hold (min) 20.  20.15.
I 1680.1685.1645.1682.1680.
ReferenceLan Phi N.T., Nishiyama C., et al., 2006Lattoo, Dhar, et al., 2006Orav, Raal, et al., 2006Sawamura, Onishi, et al., 2006Tigrine-Kordiani, Meklati, et al., 2006
Comment MSDC-RI MSDC-RI MSDC-RI MSDC-RI MSDC-RI
Column type CapillaryCapillaryCapillaryCapillaryCapillary
Active phase Supelcowax-10HP-20MStabilwaxStabilwaxInnowax
Column length (m) 30.50.30.30.60.
Carrier gas HeHeliumH2 He
Substrate
Column diameter (mm) 0.250.200.320.320.25
Phase thickness (μm) 0.250.200.50.50.25
Tstart (C) 50.70.40.40.60.
Tend (C) 250.250.280.280.240.
Heat rate (K/min) 4.4.6.6.5.
Initial hold (min) 1.4.5.5.
Final hold (min) 10.10.5.5.30.
I 1676.1633.1675.1677.1693.
ReferenceWong, Sivasothy, et al., 2006Bezic, Skocibusic, et al., 2005Jirovetz, Buchbauer, et al., 2005Jirovetz, Buchbauer, et al., 2005, 2Joichi, Yomogida, et al., 2005
Comment MSDC-RI MSDC-RI MSDC-RI MSDC-RI MSDC-RI
Column type CapillaryCapillaryCapillaryCapillaryCapillary
Active phase HP-20MDB-WaxDB-WaxSupelcowax-10DB-Wax
Column length (m) 50.60.60.30.60.
Carrier gas HeliumN2N2HeN2
Substrate
Column diameter (mm) 0.200.250.250.250.25
Phase thickness (μm) 0.200.250.250.250.25
Tstart (C) 70.70.70.50.70.
Tend (C) 180.230.230.220.230.
Heat rate (K/min) 4.2.2.4.2.
Initial hold (min) 4.2.2.3.2.
Final hold (min) 10.20.20.30.20.
I 1641.1686.1686.1675.1698.
ReferenceKulisic, Radonic, et al., 2005Njoroge, Koaze, et al., 2005Njoroge, Koaze, et al., 2005, 2Wong, Lee, et al., 2005Choi, 2004
Comment MSDC-RI MSDC-RI MSDC-RI MSDC-RI MSDC-RI
Column type CapillaryCapillaryCapillaryCapillaryCapillary
Active phase DB-WaxDB-WaxDB-WaxBP-20DB-Wax
Column length (m) 60.60.60.25.60.
Carrier gas N2HeHeN2He
Substrate
Column diameter (mm) 0.250.250.250.250.32
Phase thickness (μm) 0.25  0.250.25
Tstart (C) 70.60.60.60.35.
Tend (C) 230.220.220.220.220.
Heat rate (K/min) 2.2.2.5.3.
Initial hold (min) 2.4.4.
Final hold (min) 20.
I 1696.1676.1676.1688.1691.
ReferenceChoi, 2004, 2Jiang and Kubota, 2004Jiang and Kubota, 2004Mallavarapu, Kulkarni, et al., 2004Palá-Paúl, Brophy, et al., 2004
Comment MSDC-RI MSDC-RI MSDC-RI MSDC-RI MSDC-RI
Column type CapillaryCapillaryCapillaryCapillaryCapillary
Active phase NB-20MDB-WaxDB-WaxHP-20MHP-Innowax
Column length (m) 50.60.60.50.50.
Carrier gas He NitrogenHe
Substrate
Column diameter (mm) 0.20.250.250.20.2
Phase thickness (μm) 0.250.250.250.20.2
Tstart (C) 50.70.70.70.50.
Tend (C) 250.230.230.180.220.
Heat rate (K/min) 2.2.2.4.4.
Initial hold (min)  2.2.4.5.
Final hold (min)  20. 10.
I 1680.1697.1697.1641.1682.
ReferenceRaal, Arak, et al., 2004Sawamura, Son, et al., 2004Sawamura, Sou, et al., 2004Juteau, Jerkovic, et al., 2003Stashenko, Jaramillo, et al., 2003
Comment MSDC-RI MSDC-RI MSDC-RI MSDC-RI MSDC-RI
Column type CapillaryCapillaryCapillaryCapillaryCapillary
Active phase HP-InnowaxDB-WaxDB-WaxDB-WaxDB-Wax
Column length (m) 50.60.60.60.60.
Carrier gas  N2N2H2N2
Substrate
Column diameter (mm) 0.20.250.250.320.25
Phase thickness (μm) 0.20.250.250.250.25
Tstart (C) 50.70.70.40.70.
Tend (C) 220.230.230.245.230.
Heat rate (K/min) 4.2.2.1.52.
Initial hold (min) 5.2.2. 2.
Final hold (min)  20.20.20.20.
I 1680.1669.1671.1664.1675.
ReferenceStashenko, Jaramillo, et al., 2003Tu, Onishi, et al., 2003Tu, Onishi, et al., 2003, 2Gancel, Ollé, et al., 2002Tu, Onishi, et al., 2002
Comment MSDC-RI MSDC-RI MSDC-RI MSDC-RI MSDC-RI
Column type CapillaryCapillaryCapillaryCapillaryCapillary
Active phase DB-WaxDB-WaxCarbowax 20MBP-20PEG-20M
Column length (m) 60.60.30.50.50.
Carrier gas N2HeHeHeHe
Substrate
Column diameter (mm) 0.250.250.250.220.2
Phase thickness (μm) 0.250.250.250.25
Tstart (C) 70.45.50.60.70.
Tend (C) 230.240.215.230.220.
Heat rate (K/min) 2.3.4.2.2.
Initial hold (min)
Final hold (min)    35.
I 1688.1688.1680.1674.1677.
ReferenceTu, Thanh, et al., 2002Christoph, 2001Kasali, Oyedeji, et al., 2001Lota, de Rocca Serra, et al., 2001Orav and Kann, 2001
Comment MSDC-RI MSDC-RI MSDC-RI MSDC-RI MSDC-RI
Column type CapillaryCapillaryCapillaryCapillaryCapillary
Active phase DB-WaxCP-Wax 52CBCP-Wax 52CBDB-WaxBP-20
Column length (m) 60.50.50.60.25.
Carrier gas  HeHeNitrogen
Substrate
Column diameter (mm) 0.250.300.300.250.33
Phase thickness (μm) 0.250.250.25 0.5
Tstart (C) 30.40.40.40.80.
Tend (C) 170.220.220.200.220.
Heat rate (K/min) 2.3.3.2.5.
Initial hold (min) 4.5.5.10.
Final hold (min) 30.
I 1681.1682.1682.1697.1702.
ReferenceButtery, Light, et al., 2000Chagonda, Makanda, et al., 2000Chagonda, Makanda, et al., 2000Tamura, Boonbumrung, et al., 2000Dunlop, Bignell, et al., 1999
Comment MSDC-RI MSDC-RI MSDC-RI MSDC-RI MSDC-RI
Column type CapillaryCapillaryCapillaryCapillaryCapillary
Active phase FFAPDB-WaxBP-20CP-Wax 52CBDB-Wax
Column length (m) 25.60.25.25.60.
Carrier gas HeHeH2HeH2
Substrate
Column diameter (mm) 0.20.250.330.320.32
Phase thickness (μm)  0.250.50.20.25
Tstart (C) 70.40.80.60.60.
Tend (C) 210.200.220.240.220.
Heat rate (K/min) 3.2.5.6.3.
Initial hold (min) 10.2. 2.
Final hold (min)    10.
I 1695.1676.1702.1673.1674.
ReferenceMockute and Bernotiene, 1999Umano, Nakahara, et al., 1999Bignell, Dunlop, et al., 1998Chisowa, Hall, et al., 1998Werkhoff, Güntert, et al., 1998
Comment MSDC-RI MSDC-RI MSDC-RI MSDC-RI MSDC-RI
Column type CapillaryCapillaryCapillaryCapillaryCapillary
Active phase BP-20BP-20BP-20BP-20BP-20
Column length (m) 25.25.25.25.25.
Carrier gas H2H2H2H2
Substrate
Column diameter (mm) 0.330.330.330.330.33
Phase thickness (μm) 0.50.50.50.50.5
Tstart (C) 80.80.80.80.80.
Tend (C) 220.220.220.220.220.
Heat rate (K/min) 5.5.5.5.5.
Initial hold (min)
Final hold (min)
I 1702.1702.1702.1702.1702.
ReferenceBignell, Dunlop, et al., 1997Bignell, Dunlop, et al., 1997, 2Bignell, Dunlop, et al., 1997, 3Bignell, Dunlop, et al., 1997, 4Bignell, Dunlop, et al., 1997, 5
Comment MSDC-RI MSDC-RI MSDC-RI MSDC-RI MSDC-RI
Column type CapillaryCapillaryCapillaryCapillaryCapillary
Active phase BP-20DB-WaxSupelcowax-10Carbowax 20MCarbowax 20M
Column length (m) 25.30.30.60.50.
Carrier gas H2H2HeHeHe
Substrate
Column diameter (mm) 0.330.320.530.250.25
Phase thickness (μm) 0.50.51.0.25
Tstart (C) 80.40.80.50.60.
Tend (C) 220.220.210.150.180.
Heat rate (K/min) 5.4.3.2.2.
Initial hold (min)    10.4.
Final hold (min)    20.
I 1702.1692.1630.1705.1649.
ReferenceBignell, Dunlop, et al., 1997, 6Lebossé, Ducruet, et al., 1997Nishimura, 1995Tirado, Stashenko, et al., 1995Kawakami, Kobayashi, et al., 1993
Comment MSDC-RI MSDC-RI MSDC-RI MSDC-RI MSDC-RI
Column type CapillaryCapillaryCapillaryPackedPacked
Active phase Carbowax 20MCarbowax 20MCarbowax 20MCarbowax 20MCarbowax 20M
Column length (m) 50.100.100.2.2.
Carrier gas He  HydrogenHydrogen
Substrate    Gas-Chrom Z (80-100 mesh)Gas-Chrom Z (80-100 mesh)
Column diameter (mm) 0.250.250.25
Phase thickness (μm)
Tstart (C) 60.70.70.65.65.
Tend (C) 180.170.170.220.220.
Heat rate (K/min) 2.1.1.4.4.
Initial hold (min) 4.
Final hold (min)
I 1649.1679.1680.1696.1699.
ReferenceKawakami and Kobayashi, 1991Shibamoto and Jennings, 1977Shibamoto and Jennings, 1977Stancher and Pertoldi, 1967Stancher and Pertoldi, 1967
Comment MSDC-RI MSDC-RI MSDC-RI MSDC-RI MSDC-RI

Normal alkane RI, non-polar column, custom temperature program

Data compiled by: NIST Mass Spectrometry Data Center, William E. Wallace, director

Column type CapillaryCapillaryCapillaryCapillaryCapillary
Active phase RTX-5 MSSLB-5 MSSLB-5 MSSiloxane, 5 % PhDB-5
Column length (m) 30.30.30. 60.
Carrier gas HeliumHeliumHelium Helium
Substrate
Column diameter (mm) 0.250.250.25 0.25
Phase thickness (μm)  0.250.25 1.00
Program not specifiednot specifiednot specifiednot specified40 0C 4 0C/min -> 230 0C 100 0C/min -> 260 0C (11.7 min)
I 1240.1238.1243.1247.1241.
ReferencePinheiro, de Queiros, et al., 2013Mondello, 2012Mondello, 2012VOC BinBase, 2012Miyazaki, Plotto, et al., 2011
Comment MSDC-RI MSDC-RI MSDC-RI MSDC-RI MSDC-RI
Column type CapillaryCapillaryCapillaryCapillaryCapillary
Active phase HP-5 MSPolydimethyl siloxane, 5 % phenylHP-5HP-5HP-5 MS
Column length (m) 30. 25.25.60.
Carrier gas Helium HeliumHeliumHelium
Substrate
Column diameter (mm) 0.25 0.320.320.32
Phase thickness (μm) 0.25 0.170.171.0
Program 40 0C (10 min) 3 0C/min -> 200 0C 2 0C/min -> 220 0Cnot specified60 0C (5 min) 4 0C/min -> 220 0C 11 0C/min -> 280 0C (15 min)not specified120 0C 2 0C/min -> 240 0C 10 0C/min -> 270 0C (2 min)
I 1240.1247.1277.1271.1255.
ReferenceNance and Setzer, 2011Skogerson, Wohlgemuth, et al., 2011Custer, 2009Custer, 2009Dharmawan, Kasapis, et al., 2009
Comment MSDC-RI MSDC-RI MSDC-RI MSDC-RI MSDC-RI
Column type CapillaryCapillaryCapillaryCapillaryCapillary
Active phase HP-5 MSDB-5SLB-5 MSSLB-5 MSCB-1
Column length (m) 30.30.30.30.30.
Carrier gas HeliumHeliumHeliumHeliumHelium
Substrate
Column diameter (mm) 0.250.250.250.250.25
Phase thickness (μm) 0.250.250.250.250.25
Program 40 0C (5 min) 2 0C/min -> 270 0C -> 260 0C (20 min)50 0C 95 min) 3 0C/min -> 100 0C 4 0C/min -> 160 0C 5 0C/min -> 220 0C (15 min)50 0C 3 0C/min -> 250 0C (1 min) 10 0C/min -> 300 0C (5 min)not specified40 0C (2 min) 4 0C/min -> 180 0C 20 0C/min -> 220 0C (1 min)
I 1240.1242.1240.1235.1226.
ReferenceMancini, Arnold, et al., 2009Yang, Yang, et al., 2009Costa, De Fina, et al., 2008Costa, De Fina, et al., 2008Kannaste, Vongvanich, et al., 2008
Comment MSDC-RI MSDC-RI MSDC-RI MSDC-RI MSDC-RI
Column type CapillaryCapillaryCapillaryCapillaryCapillary
Active phase CB-1CP Sil 8 CBSLB-5 MSHP-5HP-5
Column length (m) 30.30.30.30.30.
Carrier gas Helium HeliumHeliumHelium
Substrate
Column diameter (mm) 0.250.250.250.250.25
Phase thickness (μm) 0.250.250.250.250.25
Program not specified60C => 2.5C/min => 170C => 10C/min => 250C (5min)not specified40 0C (3 min) 3 0C/min -> 160 0C (2 min) 8 0C/min -> 220 0C (3 min)not specified
I 1215.1240.1238.1244.1248.
ReferenceKannaste, Vongvanich, et al., 2008Kristiawan, Sobolik, et al., 2008Lo Presti, Sciarrone, et al., 2008Qiao, Xie, et al., 2008Qiao, Xie, et al., 2008
Comment MSDC-RI MSDC-RI MSDC-RI MSDC-RI MSDC-RI
Column type CapillaryCapillaryCapillaryCapillaryCapillary
Active phase DB-5DB-1DB-5HP-5BP-5
Column length (m) 30.30.30.30.30.
Carrier gas HeHe HeHe
Substrate
Column diameter (mm) 0.250.250.250.320.32
Phase thickness (μm) 0.10.10.250.250.25
Program 35C => 4C/min => 180C => 10C/min => 250C35C => 4C/min => 180C => 10C/min => 250C50C(1min) => 5C/min => 100C => 10C/min => 250C (9min)40 0C (2 min) 110 0C (2 min) 3 0C/min -> 170 0C (2 min) 4 0C/min -> 220 0C (2 min) 10 0C/min -> 260 0C (5 min)60C => 4C/min => 150C => 10C/min => 220C
I 1235.1238.1240.1240.1237.
ReferenceAlbuquerque M.R.J.R., Costa S.M.O., et al., 2007Albuquerque, Vasconcelos Silva, et al., 2007Beaulieu and Lancaster, 2007Dou, Li, et al., 2007Hashemi, Abolghasemi, et al., 2007
Comment MSDC-RI MSDC-RI MSDC-RI MSDC-RI MSDC-RI
Column type CapillaryCapillaryCapillaryCapillaryCapillary
Active phase DB-5CP Sil 8 CBOV-1HP-5MS5 % Phenyl methyl siloxane
Column length (m) 50.50.30.30.30.
Carrier gas HeliumHeliumHeliumHe
Substrate
Column diameter (mm) 0.320.320.250.250.25
Phase thickness (μm) 0.250.250.250.250.75
Program 60 0C (1 min) 5 0C/min -> 160 0C 10 0C/min -> 250 0C60 0C (2 min) 5 0C/min -> 160 0C (1 min) 10 0C/min -> 280 0C (3 min)40 0C (2 min) 6 0C/min -> 130 0C 10 0C/min -> 300 0C40C(3min) => 6C/min => 160C => 10C/min => 300C (10min)50C(1min) => 5C/min => 100C => 10C/min => 190C => 30C/min => 250C(1min)
I 1238.1238.1217.1244.1242.
ReferenceNivinsliene, Butkiene, et al., 2007Radusiene, Judzentiene, et al., 2007Suschke, Sporer, et al., 2007Yu, Huang, et al., 2007Beaulieu J.C. and Lea J.M., 2006
Comment MSDC-RI MSDC-RI MSDC-RI MSDC-RI MSDC-RI
Column type CapillaryCapillaryCapillaryCapillaryCapillary
Active phase HP-5MSHP-5HP-5 MSDB-5SE-52
Column length (m) 30.30.30.30.30.
Carrier gas HeHeHeliumHeHe
Substrate
Column diameter (mm) 0.250.250.250.320.32
Phase thickness (μm) 0.250.250.250.250.15
Program 50C(2min) => 6C/min => 200C => 10C/min => 270C(10min)60C(4min) => 1C/min => 64C => 2.5C/min => 155C => 5C/min => 250C40 0C (10 min) 3 0C/min -> 200 0C 2 0C/min -> 220 0C60C => 2C/min => 100C => 3C/min => 160C => 5C/min => 280C45C => 1C/min => 100C => 5C/min => 250C (10min)
I 1270.1270.1239.1237.1238.
ReferenceDeng, Xu, et al., 2006Jordan, Martinez, et al., 2006Schmidt, Noletto, et al., 2006Srivastava, Mallavarapu, et al., 2006Tognolini, Barocelli, et al., 2006
Comment MSDC-RI MSDC-RI MSDC-RI MSDC-RI MSDC-RI
Column type CapillaryCapillaryCapillaryCapillaryCapillary
Active phase DB-5BPX-5HP-5DB-1CP Sil 8 CB
Column length (m) 30.30.30.30.50.
Carrier gas HeHe HeHe
Substrate
Column diameter (mm) 0.250.320.320.250.32
Phase thickness (μm) 0.250.5  0.25
Program 80 0C (1 min) 3 0C/min -> 180 0C 10 0C/min -> 300 0C (3 min)60C(1min) => 3.5C/min => 180C => 20C/min => 280C(2min)65C(1min) => 1C/min => 75C (2min) => 0.5C/min => 81C(2min) => 3C/min => 180C(7min)35C => 4C/min => 180C => 10C/min => 250C60C(2min) => 5C/min => 160C(1min) => 10C/min => 250C (5min)
I 1240.1240.1244.1238.1240.
ReferenceBlank, Fontes, et al., 2005Koutsoudaki, Krsek, et al., 2005Singh, Maurya, et al., 2005Cavalcanti, de Morais, et al., 2004Judpentienë and Mockutë, 2004
Comment MSDC-RI MSDC-RI MSDC-RI MSDC-RI MSDC-RI
Column type CapillaryCapillaryCapillaryCapillaryCapillary
Active phase BPX-5HP-5SE-30SE-30SE-30
Column length (m) 30.30.
Carrier gas H2He
Substrate
Column diameter (mm) 0.250.25
Phase thickness (μm) 0.250.25
Program 50 0C (1 min) 3 0C/min -> 150 0C 5 0C/min -> 250 0C (5 min)60C(4min) => 1C/min => 64C => 2.5C/min => 155C => 5C/min => 250Cnot specifiednot specifiednot specified
I 1238.1270.1215.1211.1227.
ReferenceKoba, Sanda, et al., 2004Sotomayor, Martínez, et al., 2004Vinogradov, 2004Vinogradov, 2004Vinogradov, 2004
Comment MSDC-RI MSDC-RI MSDC-RI MSDC-RI MSDC-RI
Column type CapillaryCapillaryCapillaryCapillaryCapillary
Active phase HP-5Methyl SiliconeSE-30SE-30DB-5
Column length (m) 30. 60.60.15.
Carrier gas He HeHeHe
Substrate
Column diameter (mm) 0.25 0.250.250.25
Phase thickness (μm) 0.25   0.25
Program 60C (4min) => 1C/min => 64C => 2.5C/min => 155C => 5C/min => 250Cnot specified50 0C (5 min) 5 0C/min -> 165 0C 4 0C/min -> 230 0Cnot specified40C(5min) => 5C/min => 120C(10min) => 4C/min => 250C(4min) => 5C/min => 280C
I 1270.1218.1230.1277.1241.
ReferenceJordán, Martínez, et al., 2003Bakshu and Raju, 2002Li, Wu, et al., 2002Li, Wu, et al., 2002Anitescu, Doneanu, et al., 1997
Comment MSDC-RI MSDC-RI MSDC-RI MSDC-RI MSDC-RI
Column type CapillaryCapillaryCapillaryPacked
Active phase DB-5Polydimethyl siloxanesOV-101OV-101
Column length (m)    2.5
Carrier gas    N2
Substrate    Chromosorb G 60-80mesh DMCS
Column diameter (mm)
Phase thickness (μm)
Program not specifiednot specifiednot specifiednot specified
I 1240.1218.1227.1220.
ReferenceIsidorov, Zenkevich, et al., 1997Zenkevich, 1997Shibamoto, 1987Swigar and Silverstein, 1981
Comment MSDC-RI MSDC-RI MSDC-RI MSDC-RI

Normal alkane RI, non-polar column, temperature ramp

Data compiled by: NIST Mass Spectrometry Data Center, William E. Wallace, director

Column type CapillaryCapillaryCapillaryCapillaryCapillary
Active phase HP-5RTX-5 MSHP-5 MSDB-5HP-5 MS
Column length (m) 30.30.60.30.25.
Carrier gas HeliumHeliumHeliumHeliumHelium
Substrate
Column diameter (mm) 0.250.250.250.250.20
Phase thickness (μm) 0.25 0.250.250.30
Tstart (C) 60.60.40.100.40.
Tend (C) 300.240.250.260.260.
Heat rate (K/min) 4.3.3.10.10.
Initial hold (min) 3. 1.1.2.
Final hold (min) 15. 20.10.20.
I 1239.1249.1241.1244.1276.
ReferenceBertuzzi, Tirillini, et al., 2013Pinheiro, de Queiros, et al., 2013Sardashti, Valizadeh, et al., 2013Boukhris, Bouaziz, et al., 2012Sandoval-Montemayor, Garcia, et al., 2012
Comment MSDC-RI MSDC-RI MSDC-RI MSDC-RI MSDC-RI
Column type CapillaryCapillaryCapillaryCapillaryCapillary
Active phase CP-Sil 5 CBSE-30 MSHP-5 MSDB-5 MSBP-1
Column length (m) 25.30.30.60.
Carrier gas HeliumHeliumHeliumHeliumNitrogen
Substrate
Column diameter (mm) 0.250.250.250.25
Phase thickness (μm) 0.150.250.250.25
Tstart (C) 50.50.40.40.60.
Tend (C) 220.250.260.250.220.
Heat rate (K/min)  5.4.5.5.
Initial hold (min)  5. 15.10.
Final hold (min)  10.5.15.30.
I 1236.1242.1244.1239.1216.
ReferenceAmeen, Usman, et al., 2011Menichini, Tundis, et al., 2011Miyazawa, Marumoto, et al., 2011Mesa-Arango, Betancur-Galvis, et al., 2010Mishra, Chaudhary, et al., 2010
Comment MSDC-RI MSDC-RI MSDC-RI MSDC-RI MSDC-RI
Column type CapillaryCapillaryCapillaryCapillaryCapillary
Active phase CP Sil 5 CBDB-5DB-5DB-5 MSHP-5
Column length (m) 25.30.30.30.25.
Carrier gas  HeliumHeliumHeliumHelium
Substrate
Column diameter (mm) 0.250.250.250.250.20
Phase thickness (μm) 0.150.250.250.250.33
Tstart (C) 50.50.50.50.60.
Tend (C) 230.250.250.250.240.
Heat rate (K/min) 3.5.5.2.3.
Initial hold (min)  2. 5.
Final hold (min)     7.
I 1238.1238.1238.1238.1238.
ReferenceUsman, Zubair, et al., 2010Ho, Wang, et al., 2009Koba, Catherine, et al., 2009Koba, Sanda, et al., 2009Maridass, 2009
Comment MSDC-RI MSDC-RI MSDC-RI MSDC-RI MSDC-RI
Column type CapillaryCapillaryCapillaryCapillaryCapillary
Active phase BP-1DB-1 MSBPX-5BPX-5BPX-5
Column length (m) 50.30.30.30.30.
Carrier gas HeliumHeliumHydrogenHydrogenHydrogen
Substrate
Column diameter (mm) 0.220.250.250.250.25
Phase thickness (μm) 0.250.250.250.250.25
Tstart (C) 60.40.100.60.60.
Tend (C) 220.250.999.999.999.
Heat rate (K/min) 2.6.3.3.3.
Initial hold (min)  1.
Final hold (min) 20.4.
I 1220.1216.1251.1250.1250.
ReferenceOttavioli, Bighelli, et al., 2009Seo, Kim, et al., 2009Bieri and Marriott, 2008Bieri and Marriott, 2008Bieri and Marriott, 2008
Comment MSDC-RI MSDC-RI MSDC-RI MSDC-RI MSDC-RI
Column type CapillaryCapillaryCapillaryCapillaryCapillary
Active phase BPX-5BPX-5BPX-5SLB-5 MSEquity-5 MS
Column length (m) 30.30.30.30.30.
Carrier gas HydrogenHydrogenHydrogenHeliumHelium
Substrate
Column diameter (mm) 0.250.250.250.250.25
Phase thickness (μm) 0.250.250.250.250.25
Tstart (C) 60.60.60.50.40.
Tend (C) 999.999.999.250.260.
Heat rate (K/min) 3.3.5.3.1.5
Initial hold (min)    2.
Final hold (min)    10.
I 1251.1251.1252.1238.1238.
ReferenceBieri and Marriott, 2008Bieri and Marriott, 2008Bieri and Marriott, 2008Lo Presti, Sciarrone, et al., 2008Mondello, Casilli, et al., 2008
Comment MSDC-RI MSDC-RI MSDC-RI MSDC-RI MSDC-RI
Column type CapillaryCapillaryCapillaryCapillaryCapillary
Active phase OV-1OV-1HP-5MSHP-5MS5 % Phenyl methyl siloxane
Column length (m) 30.30.30.30.60.
Carrier gas HeliumHeliumHeHeHe
Substrate
Column diameter (mm) 0.250.250.250.250.25
Phase thickness (μm) 0.250.250.250.250.25
Tstart (C) 65.65.60.60.90.
Tend (C) 260.260.250.250.225.
Heat rate (K/min) 6.6.2.2.3.
Initial hold (min)   8.8.
Final hold (min)   15.15.15.
I 1262.1227.1268.1236.1240.
ReferenceWang, Yi, et al., 2008Wang, Yi, et al., 2008Ferhat, Meklati, et al., 2007Ferhat, Tigrine-Kordjani, et al., 2007Gil A., Van Baren C.M., et al., 2007
Comment MSDC-RI MSDC-RI MSDC-RI MSDC-RI MSDC-RI
Column type CapillaryCapillaryCapillaryCapillaryCapillary
Active phase DBP-5DB-1DBP-5DB-5CP Sil 5 CB
Column length (m) 25.30.25.30.30.
Carrier gas HeliumHeliumHelium
Substrate
Column diameter (mm) 0.250.250.250.250.25
Phase thickness (μm) 0.220.250.220.250.25
Tstart (C) 40.50.40.40.40.
Tend (C) 250.260.250.250.220.
Heat rate (K/min) 3.2.53.2.3.
Initial hold (min) 1.1.1.
Final hold (min) 10.20.10.33.3.
I 1208.1215.1208.1240.1238.
ReferenceHeravi and Sereshti, 2007Monser-Esfahani, Karamkhani, et al., 2007Sereshti and Samadi, 2007Sylvestre, Pichette, et al., 2007Hymete, Rohloff, et al., 2006
Comment MSDC-RI MSDC-RI MSDC-RI MSDC-RI MSDC-RI
Column type CapillaryCapillaryCapillaryCapillaryCapillary
Active phase FSOT-RSL-200DB-1OV-101CP-Sil 5 CBNB-30
Column length (m) 30.60.25.25.30.
Carrier gas Hydrogen HeHydrogenHe
Substrate
Column diameter (mm) 0.320.250.250.250.2
Phase thickness (μm) 0.250.250.250.150.25
Tstart (C) 40.70.100.50.50.
Tend (C) 280.230.250.230.250.
Heat rate (K/min) 6.2.8.3.2.
Initial hold (min) 5.2.
Final hold (min) 5.20.
I 1238.1242.1230.1249.1220.
ReferenceJirovetz, Eller, et al., 2006Lan Phi N.T., Nishiyama C., et al., 2006Lattoo, Dhar, et al., 2006Olawore, Usman, et al., 2006Orav, Raal, et al., 2006
Comment MSDC-RI MSDC-RI MSDC-RI MSDC-RI MSDC-RI
Column type CapillaryCapillaryCapillaryCapillaryCapillary
Active phase DB-5PE-5HP-5MSDB-1DB-5
Column length (m) 25.50.30.60.30.
Carrier gas N2HeHe H2
Substrate
Column diameter (mm) 0.250.320.250.250.20
Phase thickness (μm) 0.150.250.250.250.18
Tstart (C) 50.100.60.70.60.
Tend (C) 200.280.280.230.240.
Heat rate (K/min) 4.3.4.2.3.
Initial hold (min) 3.1. 2.
Final hold (min)    20.
I 1248.1235.1244.1215.1245.
ReferenceOuamba, Ouabonzi, et al., 2006Pandey-Rai S., Mallavarapu G.R., et al., 2006Sajjadi, 2006Sawamura, Onishi, et al., 2006Silva, Oliveira, et al., 2006
Comment MSDC-RI MSDC-RI MSDC-RI MSDC-RI MSDC-RI
Column type CapillaryCapillaryCapillaryCapillaryCapillary
Active phase HP-5 MSDB-1BPX-5SPB-1DB-5
Column length (m) 30.30.50.30.50.
Carrier gas Helium  He
Substrate
Column diameter (mm) 0.250.320.220.250.3
Phase thickness (μm) 0.250.251.0.250.25
Tstart (C) 60.60.70.50.60.
Tend (C) 250.230.280.250.240.
Heat rate (K/min) 2.3.4.4.2.
Initial hold (min) 8.3. 1.
Final hold (min) 15.10.4.10.
I 1236.1237.1265.1211.1240.
ReferenceTigrine-Kordiani, Meklati, et al., 2006Tohar, Mohd, et al., 2006Wohlmuth, Smith, et al., 2006Wong, Sivasothy, et al., 2006Chagonda and Chalchat, 2005
Comment MSDC-RI MSDC-RI MSDC-RI MSDC-RI MSDC-RI
Column type CapillaryCapillaryCapillaryCapillaryCapillary
Active phase DB-5HP-5HP-5MSHP-5MSHP-5MS
Column length (m) 25.25.30.30.30.
Carrier gas  He HeHe
Substrate
Column diameter (mm) 0.250.20.250.250.25
Phase thickness (μm) 0.150.330.250.250.25
Tstart (C) 40.60.50.60.50.
Tend (C) 220.240.250.280.240.
Heat rate (K/min) 3.3.3.3.3.
Initial hold (min) 5. 10.5.3.
Final hold (min)  7.5.
I 1243.1240.1244.1239.1278.
ReferenceChagonda and Chalchat, 2005, 2Duarte, Figueira, et al., 2005Melkani, Dev, et al., 2005Setzer, Noletto, et al., 2005Tepe B., Sokmen M., et al., 2005
Comment MSDC-RI MSDC-RI MSDC-RI MSDC-RI MSDC-RI
Column type CapillaryCapillaryCapillaryCapillaryCapillary
Active phase SPB-1DB-1DB-5BP-1DB-5MS
Column length (m) 50.60.60.25.30.
Carrier gas HeN2HeN2He
Substrate
Column diameter (mm) 0.20.250.250.250.25
Phase thickness (μm) 0.330.250.250.250.25
Tstart (C) 50.70.40.60.60.
Tend (C) 220.230.280.220.280.
Heat rate (K/min) 4.2.4.5.3.
Initial hold (min) 3.2.4.
Final hold (min) 30.20.  30.
I 1213.1223.1240.1217.1204.
ReferenceWong, Lee, et al., 2005Choi, 2004Kalvandi, Sefidkon, et al., 2004Mallavarapu, Kulkarni, et al., 2004Marongiu, Piras, et al., 2004
Comment MSDC-RI MSDC-RI MSDC-RI MSDC-RI MSDC-RI
Column type CapillaryCapillaryCapillaryCapillaryCapillary
Active phase HP-5MSNB-30DB-1RSL-200DB-5
Column length (m) 30.50.60.30.30.
Carrier gas HeHeHeH2He
Substrate
Column diameter (mm) 0.250.20.250.320.25
Phase thickness (μm) 0.250.250.250.250.25
Tstart (C) 60.50.70.40.60.
Tend (C) 280.250.230.280.280.
Heat rate (K/min) 3.2.2.6.3.
Initial hold (min)   2.5.
Final hold (min)   20.5.30.
I 1241.1220.1223.1227.1232.
ReferenceMimica-Dukic, Bozin, et al., 2004Raal, Arak, et al., 2004Choi, 2003Jirovetz, Buchbauer, et al., 2003Marongiu, Porcedda, et al., 2003
Comment MSDC-RI MSDC-RI MSDC-RI MSDC-RI MSDC-RI
Column type CapillaryCapillaryCapillaryCapillaryCapillary
Active phase MPS-5DB-1HP-5HP-5DB-1
Column length (m)  50.60.60.60.
Carrier gas  N2  N2
Substrate
Column diameter (mm)  0.250.250.250.25
Phase thickness (μm)  0.250.250.250.25
Tstart (C) 70.95.40.40.70.
Tend (C) 180.240.250.250.230.
Heat rate (K/min) 5.4.5.5.2.
Initial hold (min) 2. 15.15.2.
Final hold (min)     20.
I 1238.1228.1240.1239.1217.
ReferenceNakahara, Alzoreky, et al., 2003Perez-Alonso, Velasco-Negueruela, et al., 2003Stashenko, Jaramillo, et al., 2003Stashenko, Jaramillo, et al., 2003Tu, Onishi, et al., 2003
Comment MSDC-RI MSDC-RI MSDC-RI MSDC-RI MSDC-RI
Column type CapillaryCapillaryCapillaryCapillaryCapillary
Active phase DB-15 % Phenyl methyl siloxaneDB-1DB-1DB-1
Column length (m) 60.30.60.30.60.
Carrier gas N2HeHeH2He
Substrate
Column diameter (mm) 0.250.250.320.320.25
Phase thickness (μm) 0.250.250.250.250.25
Tstart (C) 70.75.50.40.40.
Tend (C) 230.200.200.245.280.
Heat rate (K/min) 2.3.3.3.4.
Initial hold (min) 2.4.6.20.5.
Final hold (min) 20.8.
I 1225.1238.1223.1209.1211.
ReferenceTu, Onishi, et al., 2003, 2Cicció and Gómez-Laurito, 2002Cimanga, Apers, et al., 2002Gancel, Ollé, et al., 2002Sefidkon, Jalili, et al., 2002
Comment MSDC-RI MSDC-RI MSDC-RI MSDC-RI MSDC-RI
Column type CapillaryCapillaryCapillaryCapillaryCapillary
Active phase Optima-1BP-5BP-1OV-101DB-5
Column length (m) 25.50.50.50.30.
Carrier gas HeH2HeHeN2
Substrate
Column diameter (mm) 0.200.250.220.20.22
Phase thickness (μm) 0.251.0.25 0.25
Tstart (C) 50.60.60.50.70.
Tend (C) 250.270.230.250.230.
Heat rate (K/min) 3.6.2.2.4.
Initial hold (min) 3.   2.
Final hold (min)   35. 20.
I 1218.1267.1213.1216.1237.
ReferenceBrun, Bessière, et al., 2001Doimo, 2001Lota, de Rocca Serra, et al., 2001Orav and Kann, 2001Mitiku, Sawamura, et al., 2000
Comment MSDC-RI MSDC-RI MSDC-RI MSDC-RI MSDC-RI
Column type CapillaryCapillaryCapillaryCapillaryCapillary
Active phase OV-101DB-5DB-5HP-5BP-1
Column length (m) 50.30.30.25.25.
Carrier gas NitrogenHeH2HeN2
Substrate
Column diameter (mm) 0.250.250.320.20.50
Phase thickness (μm)    0.33
Tstart (C) 40.40.32.70.60.
Tend (C) 200.230.260.290.220.
Heat rate (K/min) 2.4.7.3.5.
Initial hold (min) 10.1.5.8.
Final hold (min)   5.20.
I 1213.1234.1258.1242.1222.
ReferenceTamura, Boonbumrung, et al., 2000Mockute and Bernotiene, 1999Sun and Petracek, 1999Poiana, Sicari, et al., 1998Rajeswara, Kaul, et al., 1996
Comment MSDC-RI MSDC-RI MSDC-RI MSDC-RI MSDC-RI
Column type CapillaryCapillaryCapillaryCapillaryCapillary
Active phase OV-101DB-1DB-1DB-1OV-1
Column length (m) 52.60.60.60.50.
Carrier gas HeHeHeHeN2
Substrate
Column diameter (mm) 0.260.250.250.250.27
Phase thickness (μm)  0.250.250.250.2
Tstart (C) 50.80.70.70.80.
Tend (C) 220.210.270.270.240.
Heat rate (K/min) 3.3.2.52.53.
Initial hold (min)   5.5.
Final hold (min)
I 1217.1222.1215.1215.1212.
ReferenceDzumayev, Tsibulskaya, et al., 1995Nishimura, 1995Tirado, Stashenko, et al., 1995Tirado, Stashenko, et al., 1995Ramanoelina, Viano, et al., 1994
Comment MSDC-RI MSDC-RI MSDC-RI MSDC-RI MSDC-RI
Column type CapillaryCapillaryCapillaryCapillaryCapillary
Active phase HP-101OV-101OV-101DB-1OV-101
Column length (m) 50.50.50.60.50.
Carrier gas H2  HeN2
Substrate
Column diameter (mm) 0.320.250.250.250.25
Phase thickness (μm) 0.3
Tstart (C) 65.80.80.30.80.
Tend (C) 300.200.200.200.200.
Heat rate (K/min) 2.2.2.4.2.
Initial hold (min) 5.  25.
Final hold (min)    5.
I 1214.1218.1219.1213.1219.
ReferenceDemarne and van der Walt, 1993Tamura, Yang, et al., 1993Tamura, Yang, et al., 1993Buttery, Teranishi, et al., 1990Sugisawa, Yamamoto, et al., 1989
Comment MSDC-RI MSDC-RI MSDC-RI MSDC-RI MSDC-RI
Column type CapillaryCapillaryCapillaryCapillary
Active phase SE-30DB-1SE-30+IgepalSE-30+Igepal
Column length (m) 100.60.100.100.
Carrier gas N2
Substrate
Column diameter (mm) 0.250.320.250.25
Phase thickness (μm)
Tstart (C) 45.50.70.70.
Tend (C) 250.250.170.170.
Heat rate (K/min) 4.4.1.1.
Initial hold (min) 1.0.1
Final hold (min)  5.
I 1225.1211.1227.1232.
ReferencePeacock and Kuneman, 1985Flath, Mon, et al., 1983Shibamoto and Jennings, 1977Shibamoto and Jennings, 1977
Comment MSDC-RI MSDC-RI MSDC-RI MSDC-RI

Van Den Dool and Kratz RI, non-polar column, custom temperature program

Data compiled by: NIST Mass Spectrometry Data Center, William E. Wallace, director

Column type CapillaryCapillaryCapillaryCapillaryCapillary
Active phase BPX-5SLB-5MSHP-5MSSE-52BPX-5
Column length (m) 30.30.30.30.30.
Carrier gas He HeHeHe
Substrate
Column diameter (mm) 0.250.250.250.320.25
Phase thickness (μm) 0.250.250.250.150.25
Program 35C => 4C/min => 200C => 30C/min => 300C (3min)not specified50C(4min) => 10C/min => 200C(0.5min) => 20C/min => 260C(5min)45C => 1C/min => 100C => 5C/min => 250C(10min)50C => 1.5C/min => 230C => 15C/min => 260C
I 1248.1238.1235.1238.1248.
ReferenceDharmawan, Kasapis, et al., 2007Mondello, Sciarrone, et al., 2007Pérez, Navarro, et al., 2007Sacchetti, Guerrini, et al., 2006Mondello, Casilli, et al., 2005
Comment MSDC-RI MSDC-RI MSDC-RI MSDC-RI MSDC-RI
Column type CapillaryCapillaryCapillaryCapillaryCapillary
Active phase 5 % Phenyl methyl siloxaneSE-52SE-52SE-52HP-5
Column length (m) 30.25.30.25.50.
Carrier gas HeH2HeHeHe
Substrate
Column diameter (mm) 0.320.320.520.250.2
Phase thickness (μm) 0.150.430.150.250.33
Program 45C => 1C/min => 100C => 5C/min => 250C (10min)60C(8min) => 3C/min => 180C => 20C/min => 250C(10min)45C => 1C/min => 100C => 5C/min => 250C (10min)60C(8min) => 3C/min => 180C => 20C/min => 230C50C(2min) => 5C/min => 150C => 10C/min => 250C(30min)
I 1238.1240.1237.1237.1235.
ReferenceSacchetti, Maietti, et al., 2005Frizzo, Lorenzo, et al., 2004Sacchetti, Medici, et al., 2004Lorenzo, Loayza, et al., 2003García, Alvarez, et al., 2002
Comment MSDC-RI MSDC-RI MSDC-RI MSDC-RI MSDC-RI
Column type CapillaryCapillaryCapillaryCapillaryCapillary
Active phase DB-5SE-52SE-52DB-5DB-5
Column length (m) 30.30.25.30.30.
Carrier gas HeH2HeH2H2
Substrate
Column diameter (mm) 0.250.320.250.250.25
Phase thickness (μm) 0.250.400.250.250.25
Program 50C (1min) => 5C/min => 100C => 10C/min => 250C (9min)60 0C (8 min) 3 K/min -> 180 0C 20 K/min -> 250 0C (10 min)60C(8min) => 3C/min => 180C => 20C/min => 230C40C(5min) => 2C/min => 220C => 5C/min => 250C(15min)40C(5min) => 2C/min => 220C => 5C/min => 250C(15min)
I 1240.1238.1239.1231.1240.
ReferenceBeaulieu and Grimm, 2001Lorenzo, Paz, et al., 2001Lorenzo, Dellacassa, et al., 2000Boulanger, Chassagne, et al., 1999Boulanger, Chassagne, et al., 1999
Comment MSDC-RI MSDC-RI MSDC-RI MSDC-RI MSDC-RI
Column type Capillary
Active phase SE-52
Column length (m) 60.
Carrier gas He
Substrate
Column diameter (mm) 0.32
Phase thickness (μm) 0.40
Program 45 C (6 min) 3 C/min -> 111 0C 2 C/min -> 160 C 3 C/min -> 300 C (15 min)
I 1241.
ReferenceMondello, Dugo, et al., 1995
Comment MSDC-RI

Van Den Dool and Kratz RI, polar column, custom temperature program

Data compiled by: NIST Mass Spectrometry Data Center, William E. Wallace, director

Column type CapillaryCapillaryCapillaryCapillaryCapillary
Active phase DB-WaxDB-WaxRTX-WaxSupelcowax-10Carbowax 20M
Column length (m) 30.
Carrier gas He
Substrate
Column diameter (mm) 0.25
Phase thickness (μm) 0.25
Program 60C => 5C/min => 200C => 6C/min => 250C(5min)not specifiednot specifiednot specifiednot specified
I 1666.1686.1646.1706.1650.
ReferenceGuillot, Peytavi, et al., 2006Elston, Lin, et al., 2005Dugo, Mondello, et al., 2004Chisholm, Wilson, et al., 2001Lorenzo, Dellacassa, et al., 2000
Comment MSDC-RI MSDC-RI MSDC-RI MSDC-RI MSDC-RI
Column type Capillary
Active phase Supelcowax-10
Column length (m) 30.
Carrier gas He
Substrate
Column diameter (mm) 0.32
Phase thickness (μm)
Program 35C => 60C/min => 50C (5min) => 4C/min => 220C
I 1667.
ReferenceSchieberle and Grosch, 1988
Comment MSDC-RI

References

Hoskovec, Grygarová, et al., 2005
Hoskovec, Michal; Grygarová, Dana; Cvacka, Josef; Streinz, Ludvík; Zima, Jirí; Verevkin, Sergey P.; Koutek, Bohumír,
Determining the vapour pressures of plant volatiles from gas chromatographic retention data,
Journal of Chromatography A, 2005, 1083, 1-2, 161-172, https://doi.org/10.1016/j.chroma.2005.06.006
. [all data]