2,6-Octadien-1-ol, 3,7-dimethyl-, (Z)-
- Formula: C10H18O
- Molecular weight: 154.2493
- IUPAC Standard InChIKey: GLZPCOQZEFWAFX-YFHOEESVSA-N
- CAS Registry Number: 106-25-2
- Chemical structure:
View 3d structure (requires JavaScript / HTML 5) - Stereoisomers:
- Other names: cis-Geraniol; cis-3,7-Dimethyl-2,6-octadien-1-ol; Nerol; Neryl alcohol; 2-cis-3,7-Dimethyl-2,6-octadien-1-ol; (Z)-Geraniol; cis-2,6-Dimethyl-2,6-octadien-8-ol; (Z)-3,7-Dimethyl-2,6-octadien-1-ol; (Z)-Nerol; 2,6-Octadien-1-ol, 3,7-dimethyl-, (2Z)-; 3,7-Dimethyl-2,6-octadien-1-ol, cis-; 2,6-Dimethyl-2,6-octadien-8-ol; 3,7-Dimethyl-2,6-octadien-1-ol; Vernol; (2Z)-3,7-Dimethyl-2,6-octadien-1-ol; Nerol (cis-geraniol)

Phase change data

Data compiled as indicated in comments:
BS - Robert L. Brown and Stephen E. Stein
AC - William E. Acree, Jr., James S. Chickos
Reduced pressure boiling point
Tboil (K) | Pressure (bar) | Reference | Comment |
---|---|---|---|
377.2 | 0.01 | Aldrich Chemical Company Inc., 1990 | BS |
Enthalpy of vaporization
ΔvapH (kJ/mol) | Temperature (K) | Method | Reference | Comment |
---|---|---|---|---|
55.4 | 349. | A | Stephenson and Malanowski, 1987 | Based on data from 334. to 499. K.; AC |

Kovats' RI, polar column, custom temperature program

Data compiled by: NIST Mass Spectrometry Data Center, William E. Wallace, director

Column type Capillary
Active phase Carbowax
Column length (m) 127.
Carrier gas
Substrate
Column diameter (mm) 0.75
Phase thickness (μm)
Program not specified
I 1786.
ReferenceOkamoto, Ellison, et al., 1981
Comment MSDC-RI

Van Den Dool and Kratz RI, non-polar column, temperature ramp

Data compiled by: NIST Mass Spectrometry Data Center, William E. Wallace, director

Column type CapillaryCapillaryCapillaryCapillaryCapillary
Active phase Equity-5MSCP-Sil PONA GBHP-5HP-5HP-5
Column length (m) 30.100.25.30.30.
Carrier gas HeHeHeN2N2
Substrate
Column diameter (mm) 0.250.250.250.250.25
Phase thickness (μm) 0.250.250.250.250.25
Tstart (C) 50.140.60.50.60.
Tend (C) 250.230.240.220.220.
Heat rate (K/min) 3.5.4.5.5.
Initial hold (min)  10.2.10.10.
Final hold (min) 10.25.
I 1225.1215.1227.1228.1227.
ReferenceBelsito E.L., Carbone C., et al., 2007Cunicao, Lopes, et al., 2007Dehghan, Solaimanian, et al., 2007Flamini, Tebano, et al., 2007Flamini, Tebano, et al., 2007, 2
Comment MSDC-RI MSDC-RI MSDC-RI MSDC-RI MSDC-RI
Column type CapillaryCapillaryCapillaryCapillaryCapillary
Active phase BP-1DB-5DB-PetroDB-PetroRTX-1
Column length (m) 50.30.50.50.60.
Carrier gas HeHe  He
Substrate
Column diameter (mm) 0.220.320.20.20.22
Phase thickness (μm) 0.250.50.50.50.25
Tstart (C) 60.40.50.50.60.
Tend (C) 220.265.270.270.230.
Heat rate (K/min) 2.7.2.2.2.
Initial hold (min)
Final hold (min) 20.5.  35.
I 1209.1225.1232.1233.31208.
ReferenceLesueur, de Rocca Serra, et al., 2007Mahattanatawee K., Perez-Cacho P.R., et al., 2007Pang T., Zhu S., et al., 2007Pang T., Zhu S., et al., 2007Paolini J., Costa J., et al., 2007
Comment MSDC-RI MSDC-RI MSDC-RI MSDC-RI MSDC-RI
Column type CapillaryCapillaryCapillaryCapillaryCapillary
Active phase HP-101DB-5MSEquity-5DB-5DB-5
Column length (m) 25.30.60.25.30.
Carrier gas HeH2HeHe
Substrate
Column diameter (mm) 0.20.250.250.250.32
Phase thickness (μm) 0.20.251.0.250.5
Tstart (C) 70.40.40.60.40.
Tend (C) 200.285.260.200.265.
Heat rate (K/min) 3.4.35.2.7.
Initial hold (min) 2. 1.
Final hold (min) 15. 15.60.5.
I 1253.1220.1245.1220.1239.
ReferencePoliteo, Jukic, et al., 2007Radulovic, Misic, et al., 2007Rocha, Coelho, et al., 2007Rout, Rao, et al., 2007Ruiz Perez-Cacho, Mahattanatawee, et al., 2007
Comment MSDC-RI MSDC-RI MSDC-RI MSDC-RI MSDC-RI
Column type CapillaryCapillaryCapillaryCapillaryCapillary
Active phase ZB-5BP-1HP-5MSDB-1RTX-1
Column length (m) 30.50.30.25.60.
Carrier gas He He He
Substrate
Column diameter (mm) 0.320.220.250.20.22
Phase thickness (μm) 0.50.250.250.330.25
Tstart (C) 40.60.60.50.60.
Tend (C) 265.220.280.300.230.
Heat rate (K/min) 7.2.3.4.2.
Initial hold (min)
Final hold (min) 5.20.  35.
I 1228.1208.1229.1237.1209.
ReferenceRuiz Perez-Cacho, Mahattanatawee, et al., 2007Blanc, Bradesi, et al., 2006Chorianopoulos N., Evergets E., et al., 2006Osorio, Alarcon, et al., 2006Paolini J., Desjobert J.M., et al., 2006
Comment MSDC-RI MSDC-RI MSDC-RI MSDC-RI MSDC-RI
Column type CapillaryCapillaryCapillaryCapillaryCapillary
Active phase DB-5OV-1SPB-1HP-5MSHP-5MS
Column length (m) 30.25.30.30.30.
Carrier gas HeHeHeHeHe
Substrate
Column diameter (mm) 0.320.250.20.250.25
Phase thickness (μm) 0.250.250.20.250.25
Tstart (C) 60.50.70.60.80.
Tend (C) 280.220.220.280.300.
Heat rate (K/min) 3.3.3.4.4.
Initial hold (min)  1. 5.
Final hold (min)  5.15.
I 1221.1230.1209.1226.1228.6
ReferencePavlovic, Tzakou, et al., 2006Rubiolo P., Matteodo M., et al., 2006Salgueiro L.R., Pinto E., et al., 2006Saroglou, Dorizas, et al., 2006Zhao C.X., Li, et al., 2006
Comment MSDC-RI MSDC-RI MSDC-RI MSDC-RI MSDC-RI
Column type CapillaryCapillaryCapillaryCapillaryCapillary
Active phase RTX-1DB-1BP-1DB-1DB-1
Column length (m) 60.30.50.30.25.
Carrier gas  HeHeHe
Substrate
Column diameter (mm) 0.220.250.220.250.25
Phase thickness (μm) 0.250.250.250.250.25
Tstart (C) 60.40.60.40.60.
Tend (C) 220.250.220.250.180.
Heat rate (K/min) 2.3.2.3.3.
Initial hold (min)     10.
Final hold (min) 20.20.20.20.10.
I 1209.1213.1212.1214.1232.
ReferenceCozzani, Muselli, et al., 2005Fanciullino, Gancel, et al., 2005Ferrari, Tomi, et al., 2005Gancel, Ollitrault, et al., 2005bin Jantan, Yalvema, et al., 2005
Comment MSDC-RI MSDC-RI MSDC-RI MSDC-RI MSDC-RI
Column type CapillaryCapillaryCapillaryCapillaryCapillary
Active phase DB-5ZB-5RTX-1HP-5MSMega 5MS
Column length (m) 25.30.60.60.30.
Carrier gas N2HeHeHeHe
Substrate
Column diameter (mm) 0.250.320.220.20.25
Phase thickness (μm) 0.250.50.250.250.25
Tstart (C) 75.40.60.60.40.
Tend (C) 210.265.230.200.240.
Heat rate (K/min) 3.7.2.2.3.
Initial hold (min) 10.   2.
Final hold (min) 1.5.35.10.
I 1232.1222.1208.1236.1222.
Referencebin Jantan, Yalvema, et al., 2005, 2Mahattanatawee, Rouseff, et al., 2005Paolini, Costa, et al., 2005Smadja, Rondeau, et al., 2005Verzera, Trozzi, et al., 2005
Comment MSDC-RI MSDC-RI MSDC-RI MSDC-RI MSDC-RI
Column type CapillaryCapillaryCapillaryCapillaryCapillary
Active phase HP-5MSHP-5MSHP-5HP-5HP-5MS
Column length (m) 30.30.30.30.30.
Carrier gas HeHeHeHeHe
Substrate
Column diameter (mm) 0.250.250.250.250.25
Phase thickness (μm) 0.250.250.25 0.25
Tstart (C) 60.60.60.60.60.
Tend (C) 280.280.260.260.280.
Heat rate (K/min) 3.3.3.3.4.
Initial hold (min)     5.
Final hold (min)
I 1227.1229.1228.1228.1228.
ReferenceAligiannis, Kalpoutzakis, et al., 2004Chorianopoulos, Kalpoutzakis, et al., 2004Javidnia, Miri, et al., 2004Javidnia, Miri, et al., 2004, 2Karioti, Hadjipavlou-Litina, et al., 2004
Comment MSDC-RI MSDC-RI MSDC-RI MSDC-RI MSDC-RI
Column type CapillaryCapillaryCapillaryCapillaryCapillary
Active phase DB-5MSSPB-1RSL-200BP-1BP-1
Column length (m) 30.30.30.30.50.
Carrier gas HeHeH2N2He
Substrate
Column diameter (mm) 0.250.20.320.320.22
Phase thickness (μm) 0.250.20.250.250.25
Tstart (C) 40.70.40.60.60.
Tend (C) 280.220.280.220.230.
Heat rate (K/min) 4.3.6.5.2.
Initial hold (min) 2. 5.
Final hold (min)  15.5.13.35.
I 1254.1209.1233.1212.1211.
ReferenceMardarowicz, Wianowska, et al., 2004Moldão-Martins, Beirão-da-Costa, et al., 2004Ngassoum, Ousmaila, et al., 2004Raina, Kumar, et al., 2004Bianchini, Tomi, et al., 2003
Comment MSDC-RI MSDC-RI MSDC-RI MSDC-RI MSDC-RI
Column type CapillaryCapillaryCapillaryCapillaryCapillary
Active phase BP-1DB-1SPB-1SPB-1DB-1
Column length (m) 50.30.25.25.30.
Carrier gas HeHe  He
Substrate
Column diameter (mm) 0.220.250.250.250.25
Phase thickness (μm) 0.250.250.250.250.25
Tstart (C) 60.40.35.35.40.
Tend (C) 230.250.225.225.250.
Heat rate (K/min) 2.3.4.4.3.
Initial hold (min)   10.10.
Final hold (min) 35.20.  20.
I 1211.1205.1211.1211.1214.
ReferenceBianchini, Tomi, et al., 2003Brat, Rega, et al., 2003Chisholm, Wilson, et al., 2003Chisholm, Wilson, et al., 2003Gancel, Ollitrault, et al., 2003
Comment MSDC-RI MSDC-RI MSDC-RI MSDC-RI MSDC-RI
Column type CapillaryCapillaryCapillaryCapillaryCapillary
Active phase DB-5DB-5DB-5HP-5MSSPB-5
Column length (m) 30.30.30.60.30.
Carrier gas  HeN2HeHe
Substrate
Column diameter (mm) 0.320.250.250.250.25
Phase thickness (μm) 0.50.250.250.250.25
Tstart (C) 40.75.75.40.60.
Tend (C) 265.230.230.310.250.
Heat rate (K/min) 7.3.3.3.4.
Initial hold (min)  10.10.1.2.
Final hold (min) 5.20. 20.20.
I 1221.1232.1230.1231.1228.
ReferenceHögnadóttir and Rouseff, 2003Jantan, Ling, et al., 2003bin Jantan, Yassin, et al., 2003Lalel, Singh, et al., 2003Pino, Marbot, et al., 2003
Comment MSDC-RI MSDC-RI MSDC-RI MSDC-RI MSDC-RI
Column type CapillaryCapillaryCapillaryCapillaryCapillary
Active phase HP-5HP-5Mega 5MSHP-5DB-1
Column length (m) 30.30.30.30.25.
Carrier gas HeHeHeN2N2
Substrate
Column diameter (mm) 0.250.250.250.250.25
Phase thickness (μm) 0.250.250.250.25
Tstart (C) 40.60.40.60.60.
Tend (C) 240.280.240.220.180.
Heat rate (K/min) 3.4.3.5.3.
Initial hold (min)  5.2.10.10.
Final hold (min)     10.
I 1230.1225.1222.1229.1210.
ReferenceShellie and Marriott, 2003Skaltsa, Demetzos, et al., 2003Verzera, Trozzi, et al., 2003Flamini, Cioni, et al., 2002bin Jantan and bin Ahmad, 2002
Comment MSDC-RI MSDC-RI MSDC-RI MSDC-RI MSDC-RI
Column type CapillaryCapillaryCapillaryCapillaryCapillary
Active phase SE-30DB-5BP-1RTX-5SPB-5
Column length (m) 25.30.50.30.30.
Carrier gas N2HeHeHeHe
Substrate
Column diameter (mm) 0.250.250.220.250.25
Phase thickness (μm) 0.250.250.250.250.25
Tstart (C) 60.60.60.45.60.
Tend (C) 180.260.220.300.250.
Heat rate (K/min) 3.4.2.3.4.
Initial hold (min) 10.  6.2.
Final hold (min) 10. 20.10.20.
I 1210.1228.1207.1226.1228.
Referencebin Jantan, Ayop, et al., 2002Javidnia, Miri, et al., 2002Lota, de Rocca Serra, et al., 2002Mondello, Zappia, et al., 2002Pino, Marbot, et al., 2002
Comment MSDC-RI MSDC-RI MSDC-RI MSDC-RI MSDC-RI
Column type CapillaryCapillaryCapillaryCapillaryCapillary
Active phase CP Sil 5 CBHP-5HP-5MSBP-1DB-1
Column length (m) 30.30.30.50.30.
Carrier gas H2HeHeHe
Substrate
Column diameter (mm) 0.250.250.250.220.32
Phase thickness (μm) 0.250.250.250.250.25
Tstart (C) 60.60.50.60.40.
Tend (C) 280.280.250.230.240.
Heat rate (K/min) 2.3.5.2.7.
Initial hold (min) 10. 2.
Final hold (min) 40. 5.35.5.
I 1204.1207.1245.1211.1212.
ReferencePino, Marbot, et al., 2002, 2Pitarokili, Couladis, et al., 2002Shang, Hu, et al., 2002Bianchini, Tomi, et al., 2001Lin and Rouseff, 2001
Comment MSDC-RI MSDC-RI MSDC-RI MSDC-RI MSDC-RI
Column type CapillaryCapillaryCapillaryCapillaryCapillary
Active phase BP-1BP-1HP-5MSHP-5DB-1
Column length (m) 50.50.30.30.30.
Carrier gas HeHeHeHeH2
Substrate
Column diameter (mm) 0.220.220.250.200.32
Phase thickness (μm) 0.250.250.250.250.25
Tstart (C) 60.60.60.60.40.
Tend (C) 220.220.280.180.245.
Heat rate (K/min) 2.2.4.4.3.
Initial hold (min)   5.8.3.
Final hold (min)    2.20.
I 1207.1207.1225.1228.1207.
ReferenceLota, Serra, et al., 2001Lota, Serra, et al., 2001Skaltsa, Mavrommati, et al., 2001Alonzo, Bosco, et al., 2000Brat, Brillouet, et al., 2000
Comment MSDC-RI MSDC-RI MSDC-RI MSDC-RI MSDC-RI
Column type CapillaryCapillaryCapillaryCapillaryCapillary
Active phase BP-1RTX-5HP-5Mega 5MSMega 5MS
Column length (m) 50.10.30.30.30.
Carrier gas HeHeHeHeHe
Substrate
Column diameter (mm) 0.220.10.250.250.25
Phase thickness (μm) 0.250.10.250.250.25
Tstart (C) 60.50.70.40.40.
Tend (C) 230.350.230.240.240.
Heat rate (K/min) 2.12.32.3.3.
Initial hold (min)    2.2.
Final hold (min) 35.
I 1207.1233.1230.1222.1222.
ReferenceLota, de Rocca Serra, et al., 2000Mondello, Zappia, et al., 2000Song, Sawamura, et al., 2000Verzera, la Rosa, et al., 2000Verzera, Trozzi, et al., 2000
Comment MSDC-RI MSDC-RI MSDC-RI MSDC-RI MSDC-RI
Column type CapillaryCapillaryCapillaryCapillaryCapillary
Active phase DB-5MSBP-1BP-1HP-1Methyl Silicone
Column length (m) 30.50.50.60.50.
Carrier gas H2HeHeHeN2
Substrate
Column diameter (mm) 0.250.220.220.250.25
Phase thickness (μm) 0.250.250.250.250.17
Tstart (C) 40.60.60.50.80.
Tend (C) 200.230.230.250.200.
Heat rate (K/min) 2.2.2.2.52.
Initial hold (min)    5.
Final hold (min)  35.35.
I 1220.1207.1207.1230.1219.
ReferenceChassagne, Boulanger, et al., 1999Lota, Serra, et al., 1999Lota, Serra, et al., 1999Stashenko, Cervantes, et al., 1999Sumathykutty, Rao, et al., 1999
Comment MSDC-RI MSDC-RI MSDC-RI MSDC-RI MSDC-RI
Column type CapillaryCapillaryCapillaryCapillaryCapillary
Active phase CP Sil 5 CBDB-5BP-1DB-1Methyl Silicone
Column length (m) 25.30.50.60.25.
Carrier gas He HeHeHe
Substrate
Column diameter (mm) 0.250.250.220.250.2
Phase thickness (μm)  0.250.250.250.3
Tstart (C) 60.50.60.50.40.
Tend (C) 260.250.220.250.200.
Heat rate (K/min) 5.3.2.3.52.
Initial hold (min)    5.
Final hold (min)   20.
I 1212.1227.1213.1227.1219.
ReferenceWeyerstahl, Marschall, et al., 1999Isidorov, Zenkevich, et al., 1998Tam, An, et al., 1998Stashenko, Prada, et al., 1996Píry, Príbela, et al., 1995
Comment MSDC-RI MSDC-RI MSDC-RI MSDC-RI MSDC-RI
Column type CapillaryCapillaryCapillaryCapillaryCapillary
Active phase HP-101DB-5OV-101OV-101OV-101
Column length (m) 50.30.50.50.50.
Carrier gas N2HeN2N2H2
Substrate
Column diameter (mm) 0.250.250.250.250.32
Phase thickness (μm)
Tstart (C) 70.50.80.80.50.
Tend (C) 200.250.200.200.200.
Heat rate (K/min) 3.4.2.2.2.
Initial hold (min)
Final hold (min)
I 1234.1251.1211.1212.1208.
ReferenceChung, Eiserich, et al., 1993Gómez, Ledbetter, et al., 1993Yang, Sugisawa, et al., 1992Yang, Sugisawa, et al., 1992Pieribattesti, Smadja, et al., 1988
Comment MSDC-RI MSDC-RI MSDC-RI MSDC-RI MSDC-RI

References

Aldrich Chemical Company Inc., 1990
Aldrich Chemical Company Inc.,
Catalog Handbook of Fine Chemicals, Aldrich Chemical Company, Inc., Milwaukee WI, 1990, 1. [all data]
Stephenson and Malanowski, 1987
Stephenson, Richard M.; Malanowski, Stanislaw,
Handbook of the Thermodynamics of Organic Compounds, 1987, https://doi.org/10.1007/978-94-009-3173-2
. [all data]