Citronellal
- Formula: C10H18O
- Molecular weight: 154.2493
- IUPAC Standard InChIKey: NEHNMFOYXAPHSD-UHFFFAOYSA-N
- CAS Registry Number: 106-23-0
- Chemical structure:
View 3d structure (requires JavaScript / HTML 5) - Stereoisomers:
- Other names: 6-Octenal, 3,7-dimethyl-; β-Citronellal; Rhodinal; 3,7-Dimethyl-6-octenal; Citronellel; 2,3-Dihydrocitral; NSC 46106; Citronella; Citronelal

Phase change data

Data compiled by: Thermodynamics Research Center, NIST Boulder Laboratories, Chris Muzny director
Quantity | Value | Units | Method | Reference | Comment |
---|---|---|---|---|---|
Tboil | 481.0 | K | N/A | Lecat, 1926 | Uncertainty assigned by TRC = 0.5 K |

Normal alkane RI, non-polar column, temperature ramp

Data compiled by: NIST Mass Spectrometry Data Center, William E. Wallace, director

Column type CapillaryCapillaryCapillaryCapillaryCapillary
Active phase HP-5RTX-5 MSRTX-1CP-Sil 5 CBSE-30 MS
Column length (m) 30.30.60.25.30.
Carrier gas HeliumHeliumHeliumHeliumHelium
Substrate
Column diameter (mm) 0.250.250.220.250.25
Phase thickness (μm) 0.25 0.250.150.25
Tstart (C) 60.60.60.50.50.
Tend (C) 300.240.230.220.250.
Heat rate (K/min) 4.3.2. 5.
Initial hold (min) 3.   5.
Final hold (min) 15. 5. 10.
I 1154.1161.1129.1150.1156.
ReferenceBertuzzi, Tirillini, et al., 2013Pinheiro, de Queiros, et al., 2013Bendiabdellah, El Amine Dib, et al., 2012Ameen, Usman, et al., 2011Menichini, Tundis, et al., 2011
Comment MSDC-RI MSDC-RI MSDC-RI MSDC-RI MSDC-RI
Column type CapillaryCapillaryCapillaryCapillaryCapillary
Active phase DB-5 MSSLB-5 MSSLB-5 MSDB-5DB-5 MS
Column length (m) 60.10.10.30.30.
Carrier gas HeliumHeliumHeliumHeliumHelium
Substrate
Column diameter (mm) 0.250.100.100.250.25
Phase thickness (μm) 0.250.100.100.250.25
Tstart (C) 40.50.50.35.50.
Tend (C) 250.250.250.220.250.
Heat rate (K/min) 5.10.10.3.2.
Initial hold (min) 15.   5.
Final hold (min) 15.  40.
I 1157.1152.1152.1149.1153.
ReferenceMesa-Arango, Betancur-Galvis, et al., 2010Scandinaro, Tranchida, et al., 2010Scandinaro, Tranchida, et al., 2010El-Massry, El-Ghorab, et al., 2009Koba, Sanda, et al., 2009
Comment MSDC-RI MSDC-RI MSDC-RI MSDC-RI MSDC-RI
Column type CapillaryCapillaryCapillaryCapillaryCapillary
Active phase BP-1DB-1 MSDB-5HP-5 MSOV-1
Column length (m) 50.30.30.30.30.
Carrier gas HeliumHeliumHeliumHeliumHelium
Substrate
Column diameter (mm) 0.220.250.250.250.25
Phase thickness (μm) 0.250.250.250.250.25
Tstart (C) 60.40.100.60.65.
Tend (C) 220.250.300.250.260.
Heat rate (K/min) 2.6.20.2.6.
Initial hold (min)  1.2.8.
Final hold (min) 20.4.10.15.
I 1134.1130.1126.1150.1138.
ReferenceOttavioli, Bighelli, et al., 2009Seo, Kim, et al., 2009Khokra, Prakash, et al., 2008Sahraoui, Vian, et al., 2008Wang, Yi, et al., 2008
Comment MSDC-RI MSDC-RI MSDC-RI MSDC-RI MSDC-RI
Column type CapillaryCapillaryCapillaryCapillaryCapillary
Active phase OV-1HP-5 MSHP-5MS5 % Phenyl methyl siloxaneCP Sil 5 CB
Column length (m) 30.30.30.60.30.
Carrier gas HeliumHeliumHeHeN2
Substrate
Column diameter (mm) 0.250.250.250.250.25
Phase thickness (μm) 0.250.250.250.250.25
Tstart (C) 65.50.60.90.50.
Tend (C) 260.230.250.225.200.
Heat rate (K/min) 6.3.2.3.5.
Initial hold (min)  10.8.
Final hold (min)  10.15.15.
I 1153.1153.1167.1155.1142.
ReferenceWang, Yi, et al., 2008Adams, Beauchamp, et al., 2007Ferhat, Meklati, et al., 2007Gil A., Van Baren C.M., et al., 2007Hnawia, Cabalion, et al., 2007
Comment MSDC-RI MSDC-RI MSDC-RI MSDC-RI MSDC-RI
Column type CapillaryCapillaryCapillaryCapillaryCapillary
Active phase BP-1BP-1BP-1BP-1FSOT-RSL-200
Column length (m) 50.50.50.50.30.
Carrier gas He HeHeHydrogen
Substrate
Column diameter (mm) 0.220.220.220.220.32
Phase thickness (μm) 0.250.250.250.250.25
Tstart (C) 60.60.60.60.40.
Tend (C) 220.220.220.220.280.
Heat rate (K/min) 2.2.2.2.6.
Initial hold (min)     5.
Final hold (min) 20.20.20.20.5.
I 1127.1130.1131.1131.1153.
ReferenceBoti, Muselli, et al., 2006Boti, Yao, et al., 2006Fanciullino, Tomi, et al., 2006Fanciullino, Tomi, et al., 2006Jirovetz, Eller, et al., 2006
Comment MSDC-RI MSDC-RI MSDC-RI MSDC-RI MSDC-RI
Column type CapillaryCapillaryCapillaryCapillaryCapillary
Active phase DB-1BP-1DB-5DB-5DB-5
Column length (m) 60.50.25.30.50.
Carrier gas  HeN2H2
Substrate
Column diameter (mm) 0.250.220.250.200.3
Phase thickness (μm) 0.250.250.150.180.25
Tstart (C) 70.60.50.60.60.
Tend (C) 230.220.200.240.240.
Heat rate (K/min) 2.2.4.3.2.
Initial hold (min) 2. 3.
Final hold (min) 20.20.
I 1131.1130.1155.1153.1152.
ReferenceLan Phi N.T., Nishiyama C., et al., 2006Lesueur, Ban, et al., 2006Ouamba, Ouabonzi, et al., 2006Silva, Oliveira, et al., 2006Chagonda and Chalchat, 2005
Comment MSDC-RI MSDC-RI MSDC-RI MSDC-RI MSDC-RI
Column type CapillaryCapillaryCapillaryCapillaryCapillary
Active phase DB-5HP-5Methyl SiliconeDB-5HP-5MS
Column length (m) 25.25.12.530.30.
Carrier gas  HeHeHeHe
Substrate
Column diameter (mm) 0.250.20.250.250.25
Phase thickness (μm) 0.150.330.250.250.25
Tstart (C) 40.60.50.60.60.
Tend (C) 220.240.270.220.280.
Heat rate (K/min) 3.3.4.3.3.
Initial hold (min) 5.  4.5.
Final hold (min)  7.
I 1159.1154.1147.1152.1154.
ReferenceChagonda and Chalchat, 2005, 2Duarte, Figueira, et al., 2005Ricci, Fraternale, et al., 2005Salehi, Sefidkon, et al., 2005Setzer, Noletto, et al., 2005
Comment MSDC-RI MSDC-RI MSDC-RI MSDC-RI MSDC-RI
Column type CapillaryCapillaryCapillaryCapillaryCapillary
Active phase HP-5DB-1HP-5MSNB-30DB-1
Column length (m) 30.60.30.50.60.
Carrier gas HeliumN2HeHe
Substrate
Column diameter (mm) 0.320.250.250.20.25
Phase thickness (μm) 0.250.250.250.250.25
Tstart (C) 40.70.60.50.70.
Tend (C) 250.230.280.250.230.
Heat rate (K/min) 5.2.3.2.2.
Initial hold (min) 2.2.  2.
Final hold (min) 5.20.  20.
I 1152.1141.1153.1135.1141.
ReferenceN/AChoi, 2004Mimica-Dukic, Bozin, et al., 2004Raal, Arak, et al., 2004Sawamura, Son, et al., 2004
Comment MSDC-RI MSDC-RI MSDC-RI MSDC-RI MSDC-RI
Column type CapillaryCapillaryCapillaryCapillaryCapillary
Active phase DB-1DB-1SE-30DB-1HP-5
Column length (m) 60.60.12.30.30.
Carrier gas NitrogenHeHeN2Helium
Substrate
Column diameter (mm) 0.250.250.220.250.32
Phase thickness (μm) 0.250.250.30.25
Tstart (C) 70.70.70.80.70.
Tend (C) 230.230.220.250.210.
Heat rate (K/min) 2.2.3.4.2.
Initial hold (min) 2.2.
Final hold (min)  20.  60.
I 1141.1141.1131.1136.1153.
ReferenceSawamura, Sou, et al., 2004Choi, 2003Kambouche and El-Abed, 2003Mahalwal and Ali, 2003Mookdasanit, Tamura, et al., 2003
Comment MSDC-RI MSDC-RI MSDC-RI MSDC-RI MSDC-RI
Column type CapillaryCapillaryCapillaryCapillaryCapillary
Active phase MPS-5DB-1DB-1BP-5BP-1
Column length (m)  60.30.50.50.
Carrier gas  N2H2H2He
Substrate
Column diameter (mm)  0.250.320.250.22
Phase thickness (μm)  0.250.251.0.25
Tstart (C) 70.70.40.60.60.
Tend (C) 180.230.245.270.230.
Heat rate (K/min) 5.2.3.6.2.
Initial hold (min) 2.2.20.
Final hold (min)  20.  35.
I 1148.1134.1126.1165.1130.
ReferenceNakahara, Alzoreky, et al., 2003Tu, Onishi, et al., 2003Gancel, Ollé, et al., 2002Doimo, 2001Lota, de Rocca Serra, et al., 2001
Comment MSDC-RI MSDC-RI MSDC-RI MSDC-RI MSDC-RI
Column type CapillaryCapillaryCapillaryCapillaryCapillary
Active phase OV-101OV-101RSL-200DB-5OV-1
Column length (m) 50.50.60.30.25.
Carrier gas HeN2H2N2H2
Substrate
Column diameter (mm) 0.20.250.320.220.25
Phase thickness (μm)   0.250.250.25
Tstart (C) 50.80.40.70.40.
Tend (C) 250.200.250.230.220.
Heat rate (K/min) 2.2.6.4.3.
Initial hold (min)    2.5.
Final hold (min)    20.5.
I 1132.1132.1139.1152.1130.
ReferenceOrav and Kann, 2001Yang, 2001Jirovetz, Puschmann, et al., 2000Mitiku, Sawamura, et al., 2000Oberhofer, Nikiforov, et al., 1999
Comment MSDC-RI MSDC-RI MSDC-RI MSDC-RI MSDC-RI
Column type CapillaryCapillaryCapillaryCapillaryCapillary
Active phase DB-5HP-5OV-101BP-1BP-1
Column length (m) 30.25.50.25.25.
Carrier gas H2HeN2N2N2
Substrate
Column diameter (mm) 0.320.20.250.500.50
Phase thickness (μm)  0.330.17
Tstart (C) 32.70.50.60.60.
Tend (C) 260.290.220.220.220.
Heat rate (K/min) 7.3.5.5.5.
Initial hold (min) 5.8.
Final hold (min) 5.20.
I 1161.1155.1146.1137.1138.
ReferenceSun and Petracek, 1999Poiana, Sicari, et al., 1998Chacko, Jayalekshmy, et al., 1996Rajeswara, Kaul, et al., 1996Rajeswara, Kaul, et al., 1996
Comment MSDC-RI MSDC-RI MSDC-RI MSDC-RI MSDC-RI
Column type CapillaryCapillaryCapillaryCapillaryCapillary
Active phase DB-5DB-1DB-1Methyl SiliconeMethyl Silicone
Column length (m) 30.60.60.50.50.
Carrier gas  HeHeN2N2
Substrate
Column diameter (mm) 0.250.250.250.250.25
Phase thickness (μm)  0.250.250.170.17
Tstart (C) 40.70.70.80.80.
Tend (C) 210.270.270.200.200.
Heat rate (K/min) 2.2.52.52.3.
Initial hold (min) 2.5.5.
Final hold (min) 33.
I 1161.1131.1131.1137.1134.
ReferenceSohounhloue, Dangou, et al., 1996Tirado, Stashenko, et al., 1995Tirado, Stashenko, et al., 1995Gopalakrishnan, Menon, et al., 1993Gopalakrishnan, Menon, et al., 1993
Comment MSDC-RI MSDC-RI MSDC-RI MSDC-RI MSDC-RI
Column type CapillaryCapillaryCapillaryCapillaryCapillary
Active phase OV-101OV-101Ultra-1OV-101OV-101
Column length (m) 50.50.25.50.50.
Carrier gas   HeN2N2
Substrate
Column diameter (mm) 0.250.250.320.250.25
Phase thickness (μm)   0.25
Tstart (C) 80.80.80.80.80.
Tend (C) 200.200.260.200.200.
Heat rate (K/min) 2.2.3.2.2.
Initial hold (min)
Final hold (min)
I 1132.1135.1128.1137.1132.
ReferenceTamura, Yang, et al., 1993Tamura, Yang, et al., 1993Okumura, 1991Sugisawa, Yamamoto, et al., 1989Sugisawa, Yang, et al., 1989
Comment MSDC-RI MSDC-RI MSDC-RI MSDC-RI MSDC-RI
Column type CapillaryCapillaryCapillary
Active phase OV-101SE-30+IgepalSE-30+Igepal
Column length (m) 50.100.100.
Carrier gas N2
Substrate
Column diameter (mm) 0.250.250.25
Phase thickness (μm)
Tstart (C) 80.70.70.
Tend (C) 200.170.170.
Heat rate (K/min) 2.1.1.
Initial hold (min)
Final hold (min)
I 1135.1138.1140.
ReferenceSugisawa, Yang, et al., 1989Shibamoto and Jennings, 1977Shibamoto and Jennings, 1977
Comment MSDC-RI MSDC-RI MSDC-RI

Kovats' RI, non-polar column, custom temperature program

Data compiled by: NIST Mass Spectrometry Data Center, William E. Wallace, director

Column type CapillaryCapillaryCapillaryCapillary
Active phase BP-1HP-5DB-5DB-5
Column length (m) 30.30.30.30.
Carrier gas N2HeHe
Substrate
Column diameter (mm) 0.320.250.250.26
Phase thickness (μm) 0.250.25 0.25
Program 60C => 5.5C/min => 220C => 3.5C/min => 245Cnot specifiednot specifiednot specified
I 1135.1153.1153.1153.
ReferenceRao, Kaul, et al., 2003Shellie and Marriott, 2003Rao, Rout, et al., 2000Adams, 1998
Comment MSDC-RI MSDC-RI MSDC-RI MSDC-RI

Kovats' RI, non-polar column, isothermal

Data compiled by: NIST Mass Spectrometry Data Center, William E. Wallace, director

Column type CapillaryCapillaryPackedCapillary
Active phase SE-30PB-1SE-30SF-96
Column length (m) 40.42.6.145152.
Carrier gas   N2
Substrate   Chromosorb W
Column diameter (mm) 0.350.32 0.8
Phase thickness (μm) 0.35
Temperature (C) 100.130.160.135.
I 1135.21138.1146.1143.
ReferenceTudor, 1997Engewald, Knobloch, et al., 1991Hedin, Thompson, et al., 1972Sakai, Maarse, et al., 1967
Comment MSDC-RI MSDC-RI MSDC-RI MSDC-RI

Kovats' RI, non-polar column, temperature ramp

View large format table.

Column type Active phase I Reference Comment
CapillaryHP-5MS1158.Jalali-Heravi, Zekavat, et al., 200660. m/0.25 mm/0.25 μm, He, 40. C @ 1. min, 3. K/min, 250. C @ 20. min
CapillaryHP-51157.Oliveira, Leitao, et al., 200625. m/0.2 mm/0.33 μm, 3. K/min; Tstart: 60. C; Tend: 240. C
CapillaryDB-51159.Merle, Morón, et al., 200425. m/0.25 mm/0.25 μm, He, 60. C @ 6. min, 5. K/min, 180. C @ 15. min
CapillaryDB-51165.Baranauskiene, Venskutonis, et al., 200350. m/0.32 mm/0.25 μm, He, 50. C @ 2. min, 5. K/min, 280. C @ 10. min
CapillaryBP-11133.Raina, Srivastava, et al., 200125. m/0.55 mm/0.25 μm, N2, 5. K/min, 220. C @ 15. min; Tstart: 60. C
CapillaryDB-11134.Abella, Cortella, et al., 200030. m/0.25 mm/0.25 μm, 4. K/min; Tstart: 80. C; Tend: 225. C
CapillarySE-541153.Adams, 200030. m/0.26 mm/0.25 μm, He, 3. K/min; Tstart: 60. C; Tend: 246. C
CapillaryDB-51153.Adams, 2000, 230. m/0.26 mm/0.25 μm, He, 3. K/min; Tstart: 60. C; Tend: 240. C
CapillaryDB-51153.Adams, 2000, 330. m/0.26 mm/0.25 μm, He, 3. K/min; Tstart: 60. C; Tend: 246. C
CapillaryDB-51161.Rao, Rout, et al., 2000He, 2. K/min; Column length: 30. m; Column diameter: 0.25 mm; Tstart: 60. C; Tend: 180. C
CapillaryDB-51153.Adams, 199930. m/0.26 mm/0.25 μm, He, 3. K/min; Tstart: 60. C; Tend: 246. C
CapillaryHP-51151.Sajjadi and Ghassemi, 199930. m/0.25 mm/0.25 μm, He, 4. K/min; Tstart: 60. C; Tend: 280. C
CapillaryMethyl Silicone1134.Mallavarapu, Rao, et al., 1998N2, 5. K/min; Column length: 25. m; Column diameter: 0.5 mm; Tstart: 60. C; Tend: 220. C
CapillarySE-301138.Jantan, Ahmad, et al., 1996N2, 60. C @ 10. min, 3. K/min, 180. C @ 1. min; Column length: 25. m; Column diameter: 0.2 mm
CapillaryOV-1011134.Padrayuttawat, Tamura, et al., 199650. m/0.25 mm/0.2 μm, N2, 2. K/min, 200. C @ 60. min; Tstart: 80. C
CapillaryMethyl Silicone1122.3Rao, Rajanikanth, et al., 19894. K/min, 250. C @ 15. min; Column length: 12. m; Column diameter: 0.5 mm; Tstart: 70. C

Kovats' RI, polar column, isothermal

View large format table.

Column type Active phase Temperature (C) I Reference Comment
CapillaryCarbowax 20M + Igepal (20:1)135.1491.Sakai, Maarse, et al., 1967He, GAS PAK F; Column length: 152. m; Column diameter: 0.8 mm

Kovats' RI, polar column, temperature ramp

View large format table.

Column type Active phase I Reference Comment
CapillaryCarbowax 20M1479.Mallavarapu, Rao, et al., 1998N2, 5. K/min; Column length: 25. m; Column diameter: 0.5 mm; Tstart: 60. C; Tend: 200. C

Van Den Dool and Kratz RI, non-polar column, temperature ramp

View large format table.

Column type Active phase I Reference Comment
CapillaryEquity-5MS1152.Belsito E.L., Carbone C., et al., 200730. m/0.25 mm/0.25 μm, He, 3. K/min, 250. C @ 10. min; Tstart: 50. C
CapillaryBP-11132.Duquesnoy, Castola, et al., 200750. m/0.22 mm/0.25 μm, He, 2. K/min, 220. C @ 20. min; Tstart: 60. C
CapillaryHP-51155.Flamini, Tebano, et al., 200730. m/0.25 mm/0.25 μm, N2, 50. C @ 10. min, 5. K/min; Tend: 220. C
CapillaryDB-51152.Hongratanaworakit and Buchbauer, 200730. m/0.25 mm/0.25 μm, He, 3. K/min; Tstart: 60. C; Tend: 246. C
CapillaryDB-51154.Silva, Barbosa, et al., 200730. m/0.22 mm/0.25 μm, He, 55. C @ 2. min, 3. K/min, 240. C @ 15. min
CapillaryDB-51150.Batista-Pereira, Fernandes, et al., 200630. m/0.25 mm/0.25 μm, He, 60. C @ 2. min, 3. K/min; Tend: 240. C
CapillaryHP-5MS1170.Saroglou, Dorizas, et al., 200630. m/0.25 mm/0.25 μm, He, 60. C @ 5. min, 4. K/min; Tend: 280. C
CapillaryDB-51153.Su, Ho, et al., 200630. m/0.25 mm/0.25 μm, He, 50. C @ 2. min, 5. K/min; Tend: 250. C
CapillaryDB-51153.Su, Ho, et al., 2006, 230. m/0.25 mm/0.25 μm, He, 50. C @ 2. min, 5. K/min; Tend: 250. C
CapillaryDB-51161.Choi, 200560. m/0.25 mm/0.25 μm, N2, 70. C @ 2. min, 2. K/min, 230. C @ 20. min
CapillaryMDN-51150.Dugo, Mondello, et al., 200530. m/0.25 mm/0.25 μm, He, 3. K/min; Tstart: 50. C; Tend: 250. C
CapillaryDB-11133.Fanciullino, Gancel, et al., 200530. m/0.25 mm/0.25 μm, He, 3. K/min, 250. C @ 20. min; Tstart: 40. C
CapillaryDB-51160.Fang and Qian, 200530. m/0.32 mm/1. μm, N2, 40. C @ 2. min, 4. K/min, 230. C @ 10. min
CapillaryDB-11131.Gancel, Ollitrault, et al., 200530. m/0.25 mm/0.25 μm, He, 3. K/min, 250. C @ 20. min; Tstart: 40. C
CapillaryDB-11159.bin Jantan, Yalvema, et al., 200525. m/0.25 mm/0.25 μm, 60. C @ 10. min, 3. K/min, 180. C @ 10. min
CapillaryHP-5MS1148.Smadja, Rondeau, et al., 200560. m/0.2 mm/0.25 μm, He, 2. K/min, 200. C @ 10. min; Tstart: 60. C
CapillaryMega 5MS1146.Verzera, Trozzi, et al., 200530. m/0.25 mm/0.25 μm, He, 40. C @ 2. min, 3. K/min; Tend: 240. C
CapillaryRTX-51156.Dugo, Mondello, et al., 200430. m/0.25 mm/0.25 μm, He, 45. C @ 6. min, 3. K/min, 300. C @ 10. min
CapillaryRSL-2001154.Ngassoum, Ousmaila, et al., 200430. m/0.32 mm/0.25 μm, H2, 40. C @ 5. min, 6. K/min, 280. C @ 5. min
CapillaryHP-51152.Stashenko, Jaramillo, et al., 200450. m/0.2 mm/0.2 μm, He, 40. C @ 15. min, 3. K/min, 250. C @ 40. min
CapillarySPB-11132.Chisholm, Jell, et al., 200330. m/0.25 mm/0.25 μm, He, 35. C @ 5. min, 4. K/min, 225. C @ 20. min
CapillarySPB-11132.Chisholm, Jell, et al., 200330. m/0.25 mm/0.25 μm, He, 35. C @ 5. min, 4. K/min, 225. C @ 20. min
CapillarySPB-11134.Chisholm, Wilson, et al., 200325. m/0.25 mm/0.25 μm, 35. C @ 10. min, 4. K/min; Tend: 225. C
CapillarySPB-11134.Chisholm, Wilson, et al., 200325. m/0.25 mm/0.25 μm, 35. C @ 10. min, 4. K/min; Tend: 225. C
CapillaryDB-51161.Choi, 200330. m/0.25 mm/0.25 μm, N2, 70. C @ 2. min, 2. K/min, 230. C @ 20. min
CapillaryDB-11131.Gancel, Ollitrault, et al., 200330. m/0.25 mm/0.25 μm, He, 3. K/min, 250. C @ 20. min; Tstart: 40. C
CapillaryDB-51159.Högnadóttir and Rouseff, 200330. m/0.32 mm/0.5 μm, 7. K/min, 265. C @ 5. min; Tstart: 40. C
CapillaryDB-51156.Högnadóttir and Rouseff, 200330. m/0.32 mm/0.5 μm, 7. K/min, 265. C @ 5. min; Tstart: 40. C
CapillaryDB-51159.Jantan, Ling, et al., 200330. m/0.25 mm/0.25 μm, He, 75. C @ 10. min, 3. K/min, 230. C @ 20. min
CapillaryDB-51153.bin Jantan, Yassin, et al., 200330. m/0.25 mm/0.25 μm, N2, 75. C @ 10. min, 3. K/min; Tend: 230. C
CapillaryMS51155.Shao, Marriott, et al., 200325. m/0.25 mm/0.25 μm, 3. K/min; Tstart: 40. C; Tend: 180. C
CapillaryRTX-51152.Shellie, Marriott, et al., 200330. m/0.25 mm/0.25 μm, He, 45. C @ 6. min, 3. K/min; Tend: 250. C
CapillaryHP-51155.Shellie and Marriott, 200330. m/0.25 mm/0.25 μm, He, 3. K/min; Tstart: 40. C; Tend: 240. C
CapillaryMega 5MS1146.Verzera, Trozzi, et al., 200330. m/0.25 mm/0.25 μm, He, 40. C @ 2. min, 3. K/min; Tend: 240. C
CapillaryDB-11138.bin Jantan and bin Ahmad, 2002N2, 60. C @ 10. min, 3. K/min, 180. C @ 10. min; Column length: 25. m; Column diameter: 0.25 mm
CapillarySE-301138.bin Jantan, Ayop, et al., 200225. m/0.25 mm/0.25 μm, N2, 60. C @ 10. min, 3. K/min, 180. C @ 10. min
CapillaryBP-11130.Lota, de Rocca Serra, et al., 200250. m/0.22 mm/0.25 μm, He, 2. K/min, 220. C @ 20. min; Tstart: 60. C
CapillaryRTX-51155.Mondello, Zappia, et al., 200230. m/0.25 mm/0.25 μm, He, 45. C @ 6. min, 3. K/min, 300. C @ 10. min
CapillaryHP-11130.Nath, Sarma, et al., 200224. m/0.32 mm/0.17 μm, He, 60. C @ 2. min, 4. K/min, 250. C @ 20. min
CapillarySPB-11134.Chisholm, Wilson, et al., 200115. m/0.25 mm/0.25 μm, 35. C @ 3. min, 6. K/min, 225. C @ 10. min
CapillaryDB-11138.Lin and Rouseff, 200130. m/0.32 mm/0.25 μm, 7. K/min, 240. C @ 5. min; Tstart: 40. C
CapillaryBP-11130.Lota, Serra, et al., 200150. m/0.22 mm/0.25 μm, He, 2. K/min; Tstart: 60. C; Tend: 220. C
CapillaryHP-51152.Alonzo, Bosco, et al., 200030. m/0.20 mm/0.25 μm, He, 60. C @ 8. min, 4. K/min, 180. C @ 2. min
CapillaryDB-51137.Bartley and Jacobs, 200060. m/0.25 mm/0.25 μm, He, 40. C @ 2. min, 4. K/min, 290. C @ 5. min
CapillaryBP-11130.Lota, de Rocca Serra, et al., 200050. m/0.22 mm/0.25 μm, He, 2. K/min, 230. C @ 35. min; Tstart: 60. C
CapillaryBP-11130.Lota, de Rocca Serra, et al., 200050. m/0.22 mm/0.25 μm, He, 2. K/min, 230. C @ 35. min; Tstart: 60. C
CapillaryRTX-51157.Mondello, Zappia, et al., 200010. m/0.1 mm/0.1 μm, He, 12.3 K/min; Tstart: 50. C; Tend: 350. C
CapillaryDB-51154.Song, Sawamura, et al., 200030. m/0.25 mm/0.25 μm, N2, 2. K/min; Tstart: 70. C; Tend: 230. C
CapillaryMega 5MS1146.Verzera, la Rosa, et al., 200030. m/0.25 mm/0.25 μm, He, 40. C @ 2. min, 3. K/min; Tend: 240. C
CapillaryMega 5MS1146.Verzera, Trozzi, et al., 200030. m/0.25 mm/0.25 μm, He, 40. C @ 2. min, 3. K/min; Tend: 240. C
CapillaryBP-11130.Lota, Serra, et al., 199950. m/0.22 mm/0.25 μm, He, 2. K/min, 230. C @ 35. min; Tstart: 60. C
CapillaryBP-11130.Lota, Serra, et al., 199950. m/0.22 mm/0.25 μm, He, 2. K/min, 230. C @ 35. min; Tstart: 60. C
CapillaryDB-11146.Combariza, Tirado, et al., 199460. m/0.25 mm/0.25 μm, He, 70. C @ 5. min, 2.5 K/min, 250. C @ 15. min
CapillaryOV-1011132.Yang, Sugisawa, et al., 1992N2, 2. K/min; Column length: 50. m; Column diameter: 0.25 mm; Tstart: 80. C; Tend: 200. C
CapillaryOV-1011135.Yang, Sugisawa, et al., 1992N2, 2. K/min; Column length: 50. m; Column diameter: 0.25 mm; Tstart: 80. C; Tend: 200. C

Van Den Dool and Kratz RI, non-polar column, custom temperature program

View large format table.

Column type Active phase I Reference Comment
CapillaryBPX-51160.Dharmawan, Kasapis, et al., 200730. m/0.25 mm/0.25 μm, He; Program: 35C => 4C/min => 200C => 30C/min => 300C (3min)
CapillarySE-521153.Sacchetti, Guerrini, et al., 200630. m/0.32 mm/0.15 μm, He; Program: 45C => 1C/min => 100C => 5C/min => 250C(10min)
Capillary5 % Phenyl methyl siloxane1153.Sacchetti, Maietti, et al., 200530. m/0.32 mm/0.15 μm, He; Program: 45C => 1C/min => 100C => 5C/min => 250C (10min)
CapillaryDB-5MS1148.Zheng, Kim, et al., 200530. m/0.25 mm/0.25 μm, He; Program: 40 (5min) => 4C/min => 140C => 4C/min => 200C (20min)
CapillarySE-521154.Frizzo, Lorenzo, et al., 200425. m/0.32 mm/0.43 μm, H2; Program: 60C(8min) => 3C/min => 180C => 20C/min => 250C(10min)
CapillarySE-521150.Lorenzo, Loayza, et al., 200325. m/0.25 mm/0.25 μm, He; Program: 60C(8min) => 3C/min => 180C => 20C/min => 230C
CapillarySE-521158.Lorenzo, Dellacassa, et al., 200025. m/0.25 mm/0.25 μm, He; Program: 60C(8min) => 3C/min => 180C => 20C/min => 230C
CapillarySE-521151.Mondello, Dugo, et al., 199560. m/0.32 mm/0.40 μm, He; Program: 45 C (6 min) 3 C/min -> 111 0C 2 C/min -> 160 C 3 C/min -> 300 C (15 min)

Van Den Dool and Kratz RI, polar column, temperature ramp

View large format table.

Column type Active phase I Reference Comment
CapillaryBP-201488.Duquesnoy, Castola, et al., 200750. m/0.22 mm/0.25 μm, He, 2. K/min, 220. C @ 20. min; Tstart: 60. C
CapillaryDB-Wax1495.Mahattanatawee K., Perez-Cacho P.R., et al., 200730. m/0.32 mm/0.5 μm, He, 7. K/min, 240. C @ 5. min; Tstart: 40. C
CapillaryDB-Wax1488.Choi, 200560. m/0.25 mm/0.25 μm, N2, 70. C @ 2. min, 2. K/min, 230. C @ 20. min
CapillaryDB-Wax1460.Fanciullino, Gancel, et al., 200530. m/0.25 mm/0.25 μm, He, 3. K/min, 250. C @ 20. min; Tstart: 40. C
CapillaryStabilwax1508.Fang and Qian, 200530. m/0.32 mm/1. μm, N2, 40. C @ 2. min, 4. K/min, 230. C @ 10. min
CapillaryDB-Wax1464.Gancel, Ollitrault, et al., 200530. m/0.25 mm/0.25 μm, He, 3. K/min, 250. C @ 20. min; Tstart: 40. C
CapillaryDB-Wax1481.Njoroge, Koaze, et al., 200560. m/0.25 mm/0.25 μm, N2, 70. C @ 2. min, 2. K/min, 230. C @ 20. min
CapillarySupelcowax-101442.Smadja, Rondeau, et al., 200560. m/0.2 mm/0.2 μm, He, 2. K/min, 200. C @ 10. min; Tstart: 60. C
CapillaryMegawax1457.Verzera, Trozzi, et al., 200530. m/0.25 mm/0.25 μm, He, 40. C @ 6. min, 2. K/min, 220. C @ 10. min
CapillaryDB-Wax1474.Brophy, Goldsack, et al., 200460. m/0.32 mm/0.25 μm, He, 3. K/min; Tstart: 32. C; Tend: 220. C
CapillaryRTX-Wax1466.Dugo, Mondello, et al., 200430. m/0.25 mm/0.25 μm, He, 45. C @ 6. min, 3. K/min, 240. C @ 10. min
CapillaryInnowax1487.Chisholm, Jell, et al., 200315. m/0.25 mm/0.25 μm, He, 35. C @ 5. min, 4. K/min, 225. C @ 20. min
CapillarySupelcowax1499.Chisholm, Wilson, et al., 200325. m/0.25 mm/0.25 μm, 35. C @ 5. min, 4. K/min, 225. C @ 10. min
CapillaryDB-Wax1485.Choi, 200360. m/0.25 mm/0.25 μm, N2, 70. C @ 2. min, 2. K/min, 230. C @ 20. min
CapillaryDB-Wax1464.Gancel, Ollitrault, et al., 200360. m/0.32 mm/0.25 μm, H2, 1.5 K/min, 245. C @ 20. min; Tstart: 40. C
CapillaryDB-Wax1488.Högnadóttir and Rouseff, 200330. m/0.32 mm/0.5 μm, 7. K/min, 240. C @ 5. min; Tstart: 40. C
CapillaryRTX-Wax1461.Shellie, Marriott, et al., 200330. m/0.25 mm/0.25 μm, He, 45. C @ 6. min, 3. K/min; Tend: 250. C
CapillaryMegawax1457.Verzera, Trozzi, et al., 200330. m/0.25 mm/0.25 μm, He, 40. C @ 6. min, 2. K/min, 220. C @ 10. min
CapillaryBP-201473.Lota, de Rocca Serra, et al., 200250. m/0.22 mm/0.25 μm, He, 2. K/min, 220. C @ 20. min; Tstart: 60. C
CapillaryRTX-Wax1459.Mondello, Zappia, et al., 200230. m/0.25 mm/0.25 μm, He, 45. C @ 6. min, 3. K/min, 250. C @ 10. min
CapillaryDB-Wax1495.Lin and Rouseff, 200130. m/0.32 mm/0.50 μm, He, 7. K/min, 240. C @ 5. min; Tstart: 40. C
CapillaryBP-201473.Lota, Serra, et al., 200150. m/0.22 mm/0.25 μm, He, 2. K/min; Tstart: 60. C; Tend: 220. C
CapillaryDB-Wax1489.Bartley and Jacobs, 200060. m/0.5 mm/0.32 μm, He, 40. C @ 2. min, 4. K/min, 290. C @ 5. min
CapillaryDB-Wax1485.Brophy, Goldsack, et al., 200060. m/0.53 mm/1.0 μm, He, 3. K/min; Tstart: 50. C; Tend: 220. C
CapillaryDB-Wax1486.Choi and Sawamura, 200060. m/0.25 mm/0.25 μm, N2, 70. C @ 2. min, 2. K/min, 230. C @ 20. min
CapillaryBP-201473.Lota, de Rocca Serra, et al., 200050. m/0.22 mm/0.25 μm, He, 2. K/min, 230. C @ 35. min; Tstart: 60. C
CapillaryBP-201473.Lota, de Rocca Serra, et al., 200050. m/0.22 mm/0.25 μm, He, 2. K/min, 230. C @ 35. min; Tstart: 60. C
CapillaryMegawax1457.Verzera, Trozzi, et al., 200030. m/0.25 mm/0.25 μm, He, 40. C @ 6. min, 2. K/min, 220. C @ 10. min
CapillaryBP-201473.Lota, Serra, et al., 199950. m/0.22 mm/0.25 μm, He, 2. K/min, 230. C @ 35. min; Tstart: 60. C
CapillaryBP-201473.Lota, Serra, et al., 199950. m/0.22 mm/0.25 μm, He, 2. K/min, 230. C @ 35. min; Tstart: 60. C
CapillaryDB-Wax1467.Möllenbeck, König, et al., 199725. m/0.25 mm/0.25 μm, He, 50. C @ 3. min, 4. K/min; Tend: 240. C
CapillaryCarbowax 20M1472.Mondello, Dugo, et al., 199560. m/0.32 mm/0.425 μm, He, 45. C @ 3. min, 3. K/min, 300. C @ 20. min
CapillaryDB-Wax1472.Combariza, Tirado, et al., 199460. m/0.25 mm/0.25 μm, He, 50. C @ 10. min, 2. K/min, 150. C @ 20. min
CapillaryCP-Wax 52CB1475.Wu and Yang, 1994H2, 50. C @ 10. min, 1.5 K/min, 200. C @ 40. min; Column length: 50. m; Column diameter: 0.32 mm
CapillaryCarbowax 20M1461.Chen and Ho, 1988He, 1.5 K/min, 225. C @ 80. min; Column length: 60. m; Column diameter: 0.32 mm; Tstart: 50. C

Van Den Dool and Kratz RI, polar column, custom temperature program

View large format table.

Column type Active phase I Reference Comment
CapillaryDB-Wax1489.Elston, Lin, et al., 2005Program: not specified
CapillaryRTX-Wax1457.Dugo, Mondello, et al., 2004Program: not specified
CapillaryBP-201458.Lorenzo, Loayza, et al., 200325. m/0.25 mm/0.25 μm, He; Program: 40C(8min) => 3C/min => 180C => 20C/min => 230C
CapillarySupelcowax-101491.Chisholm, Wilson, et al., 2001Program: not specified
CapillaryCarbowax 20M1432.Lorenzo, Dellacassa, et al., 2000Program: not specified
CapillarySupelcowax-101450.Schieberle and Grosch, 1988He; Column length: 30. m; Column diameter: 0.32 mm; Program: 35C => 60C/min => 50C (5min) => 4C/min => 220C

Normal alkane RI, non-polar column, custom temperature program

View large format table.

Column type Active phase I Reference Comment
CapillaryRTX-5 MS1153.Pinheiro, de Queiros, et al., 2013Helium; Column length: 30. m; Column diameter: 0.25 mm; Program: not specified
CapillaryRTX-11130.Bendiabdellah, El Amine Dib, et al., 201260. m/0.22 mm/0.25 μm, Helium; Program: not specified
CapillarySiloxane, 5 % Ph1151.VOC BinBase, 2012Program: not specified
CapillaryOV-11124.Chen and Li, 2011Helium; Column length: 30. m; Column diameter: 0.25 mm; Program: 40 0C 2 0C/min -> 120 0C 10 0C/min -> 230 0C (15 min)
CapillaryPolydimethyl siloxane, 5 % phenyl1151.Skogerson, Wohlgemuth, et al., 2011Program: not specified
CapillarySLB-5 MS1152.Scandinaro, Tranchida, et al., 201010. m/0.10 mm/0.10 μm, Helium; Program: not specified
CapillaryZB-1 MS1125.Al-Reza, Rahman, et al., 200930. m/0.25 mm/0.25 μm, Helium; Program: 50 0C 3 0C/min -> 150 0C (10 min) 10 0C/min -> 250 0C
CapillaryDB-11138.Delort and Jaquier, 200960. m/0.25 mm/0.25 μm, Helium; Program: 50 0C (5 min) 3 0C/min -> 120 0C 5 0C/min -> 250 0C (3 min) 15 0C/min -> 300 0C (20 min)
CapillaryHP-5 MS1166.Dharmawan, Kasapis, et al., 200960. m/0.32 mm/1.0 μm, Helium; Program: 120 0C 2 0C/min -> 240 0C 10 0C/min -> 270 0C (2 min)
CapillaryHP-51153.Riahi, Pourbasheer, et al., 2009Column length: 30. m; Column diameter: 0.32 mm; Program: not specified
CapillaryCB-11128.Kannaste, Vongvanich, et al., 200830. m/0.25 mm/0.25 μm, Helium; Program: 40 0C (2 min) 4 0C/min -> 180 0C 20 0C/min -> 220 0C (1 min)
CapillaryCB-11129.Kannaste, Vongvanich, et al., 200830. m/0.25 mm/0.25 μm, Helium; Program: not specified
CapillaryDB-51153.Nivinsliene, Butkiene, et al., 200750. m/0.32 mm/0.25 μm, Helium; Program: 60 0C (1 min) 5 0C/min -> 160 0C 10 0C/min -> 250 0C
CapillaryCP Sil 8 CB1153.Radusiene, Judzentiene, et al., 200750. m/0.32 mm/0.25 μm, Helium; Program: 60 0C (2 min) 5 0C/min -> 160 0C (1 min) 10 0C/min -> 280 0C (3 min)
CapillaryOV-11130.Suschke, Sporer, et al., 200730. m/0.25 mm/0.25 μm, Helium; Program: 40 0C (2 min) 6 0C/min -> 130 0C 10 0C/min -> 300 0C
CapillaryHP-5 MS1154.Schmidt, Noletto, et al., 200630. m/0.25 mm/0.25 μm, Helium; Program: 40 0C (10 min) 3 0C/min -> 200 0C 2 0C/min -> 220 0C
CapillaryHP-5MS1156.Singh G., Maurya S., et al., 200630. m/0.32 mm/0.25 μm, He; Program: 60C(1min) => 1.5C => 185C => 9C/min => 275C (2min)
CapillaryDB-51153.Blank, Fontes, et al., 200530. m/0.25 mm/0.25 μm, He; Program: 80 0C (1 min) 3 0C/min -> 180 0C 10 0C/min -> 300 0C (3 min)
CapillaryCP Sil 8 CB1153.Butkienë, Nivinskienë, et al., 200550. m/0.32 mm/0.25 μm, He; Program: 50C(5min) => 2C/min => 90C => 15C/min => 240C(4min)
CapillaryHP-51145.Riu-Aumatell, Lopez-Tamames, et al., 2005Program: not specified
CapillaryHP-51156.Singh, Maurya, et al., 2005Column length: 30. m; Column diameter: 0.32 mm; Program: 65C(1min) => 1C/min => 75C (2min) => 0.5C/min => 81C(2min) => 3C/min => 180C(7min)
CapillaryBPX-51153.Koba, Sanda, et al., 200430. m/0.25 mm/0.25 μm, H2; Program: 50 0C (1 min) 3 0C/min -> 150 0C 5 0C/min -> 250 0C (5 min)
CapillarySE-301128.Vinogradov, 2004Program: not specified
CapillarySE-541156.Buettner, Mestres, et al., 200330. m/0.32 mm/0.25 μm; Program: 35C (2min) => 40C/min => 50C (2min) => 6C/min => 180C => 10C/min => 230C (10min)
CapillaryHP-11132.Betts, 200012. m/0.20 mm/0.33 μm, He; Program: 40 0C 6.7 0C/min -> 87 0C (9 min) 10 0C/min -> 187 0C
CapillaryDB-11121.Baratta, Dorman, et al., 199830. m/0.25 mm/0.25 μm, He; Program: 45C => 3C/min => 175C => 15C/min => 240C (10min)
CapillaryDB-11121.da Silva, Figueiredo, et al., 199830. m/0.25 mm/0.25 μm, H2; Program: 45C => 3C/min => 175C => 15C => 240C(10min)
CapillaryDB-51153.Isidorov, Zenkevich, et al., 1997Program: not specified
CapillaryPolydimethyl siloxanes1137.Zenkevich, 1997Program: not specified
CapillaryOV-1011137.Shibamoto, 1987Program: not specified
PackedOV-1011136.Swigar and Silverstein, 1981N2, Chromosorb G 60-80mesh DMCS; Column length: 2.5 m; Program: not specified

Normal alkane RI, polar column, temperature ramp

View large format table.

Column type Active phase I Reference Comment
CapillaryTC-Wax1483.Miyazawa, Fujita, et al., 2010Helium, 40. C @ 3. min, 3. K/min; Column length: 60. m; Column diameter: 0.25 mm; Tend: 230. C
CapillaryBP-201486.Ottavioli, Bighelli, et al., 200950. m/0.22 mm/0.25 μm, Helium, 2. K/min, 220. C @ 20. min; Tstart: 60. C
CapillaryInnowax1486.Seo, Kim, et al., 200930. m/0.25 mm/0.25 μm, Helium, 40. C @ 1. min, 6. K/min, 250. C @ 4. min
CapillaryHP-Innowax1488.Charoensiddhi and Anprung, 200830. m/0.25 mm/0.25 μm, Helium, 50. C @ 10. min, 15. K/min, 240. C @ 19. min
CapillaryCarbowax1478.Ferhat, Meklati, et al., 200760. m/0.2 mm/0.25 μm, He, 60. C @ 8. min, 2. K/min, 250. C @ 15. min
CapillaryPEG-20M1481.Gil A., Van Baren C.M., et al., 200760. m/0.25 mm/0.25 μm, He, 3. K/min, 225. C @ 15. min; Tstart: 90. C
CapillaryBP-201472.Boti, Muselli, et al., 200650. m/0.22 mm/0.25 μm, He, 2. K/min, 220. C @ 20. min; Tstart: 60. C
CapillaryBP-201478.Boti, Yao, et al., 200650. m/0.22 mm/0.25 μm, 2. K/min, 220. C @ 20. min; Tstart: 60. C
CapillaryDB-Wax1488.Choi H.S., 200660. m/0.25 mm/0.25 μm, He, 70. C @ 2. min, 2. K/min, 230. C @ 20. min
CapillaryBP-201479.Fanciullino, Tomi, et al., 200650. m/0.22 mm/0.25 μm, He, 2. K/min, 220. C @ 20. min; Tstart: 60. C
CapillaryBP-201479.Fanciullino, Tomi, et al., 200650. m/0.22 mm/0.25 μm, He, 2. K/min, 220. C @ 20. min; Tstart: 60. C
CapillaryDB-Wax1479.Lan Phi N.T., Nishiyama C., et al., 200660. m/0.25 mm/0.25 μm, 70. C @ 2. min, 2. K/min, 230. C @ 20. min
CapillaryDB-Wax Etr1501.Perestrelo, Fernandes, et al., 200630. m/0.25 mm/0.25 μm, He, 40. C @ 1. min, 2. K/min, 220. C @ 10. min
CapillaryStabilwax1465.Jirovetz, Buchbauer, et al., 200530. m/0.32 mm/0.5 μm, H2, 40. C @ 5. min, 6. K/min, 280. C @ 5. min
CapillaryStabilwax1465.Jirovetz, Buchbauer, et al., 2005, 230. m/0.32 mm/0.5 μm, 40. C @ 5. min, 6. K/min, 280. C @ 5. min
CapillaryDB-Wax1492.Njoroge, Koaze, et al., 2005, 260. m/0.25 mm/0.25 μm, N2, 70. C @ 2. min, 2. K/min, 230. C @ 20. min
CapillaryDB-Wax1492.Njoroge, Koaze, et al., 2005, 360. m/0.25 mm/0.25 μm, N2, 70. C @ 2. min, 2. K/min, 230. C @ 20. min
CapillarySupelcowax-101477.Vichi, Riu-Aumatell, et al., 200530. m/0.25 mm/0.25 μm, 40. C @ 5. min, 3. K/min, 220. C @ 10. min
CapillaryZB-Wax1457.N/A30. m/0.32 mm/0.25 μm, Helium, 40. C @ 2. min, 5. K/min, 250. C @ 5. min
CapillaryZB-Wax1457.Wu, Krings, et al., 200530. m/0.32 mm/0.25 μm, He, 40. C @ 2. min, 5. K/min, 250. C @ 10. min
CapillaryDB-Wax1488.Choi, 200460. m/0.25 mm/0.25 μm, N2, 70. C @ 2. min, 2. K/min, 230. C @ 20. min
CapillaryDB-Wax1485.Choi, 2004, 260. m/0.25 mm/0.25 μm, N2, 70. C @ 2. min, 2. K/min, 230. C @ 20. min
CapillaryDB-Wax1479.Jiang and Kubota, 2004He, 60. C @ 4. min, 2. K/min; Column length: 60. m; Column diameter: 0.25 mm; Tend: 220. C
CapillaryDB-Wax1479.Jiang and Kubota, 2004He, 60. C @ 4. min, 2. K/min; Column length: 60. m; Column diameter: 0.25 mm; Tend: 220. C
CapillaryNB-20M1480.Raal, Arak, et al., 200450. m/0.2 mm/0.25 μm, He, 2. K/min; Tstart: 50. C; Tend: 250. C
CapillaryDB-Wax1497.Sawamura, Son, et al., 200460. m/0.25 mm/0.25 μm, 70. C @ 2. min, 2. K/min, 230. C @ 20. min
CapillaryDB-Wax1497.Sawamura, Sou, et al., 200460. m/0.25 mm/0.25 μm, Nitrogen, 70. C @ 2. min, 2. K/min; Tend: 230. C
CapillaryDB-Wax1479.Mookdasanit, Tamura, et al., 2003Helium, 2. K/min, 210. C @ 60. min; Column length: 60. m; Column diameter: 0.25 mm; Tstart: 70. C
CapillaryPEG 20M1465.Nakahara, Alzoreky, et al., 200370. C @ 2. min, 5. K/min; Tend: 180. C
CapillaryDB-Wax1489.Tu, Onishi, et al., 2003, 260. m/0.25 mm/0.25 μm, N2, 70. C @ 2. min, 2. K/min, 230. C @ 20. min
CapillaryDB-Wax1488.Tu, Onishi, et al., 200360. m/0.25 mm/0.25 μm, N2, 70. C @ 2. min, 2. K/min, 230. C @ 20. min
CapillaryDB-Wax1467.Gancel, Ollé, et al., 200260. m/0.32 mm/0.25 μm, H2, 1.5 K/min, 245. C @ 20. min; Tstart: 40. C
CapillaryDB-Wax1476.Tu, Onishi, et al., 200260. m/0.25 mm/0.25 μm, N2, 70. C @ 2. min, 2. K/min, 230. C @ 20. min
CapillaryDB-Wax1486.Tu, Thanh, et al., 200260. m/0.25 mm/0.25 μm, N2, 2. K/min; Tstart: 70. C; Tend: 230. C
CapillaryDB-Wax1465.Umano, Hagi, et al., 200260. m/0.25 mm/0.25 μm, He, 40. C @ 2. min, 2. K/min; Tend: 200. C
CapillaryDB-Wax1487.Christoph, 200160. m/0.25 mm/0.25 μm, He, 3. K/min; Tstart: 45. C; Tend: 240. C
CapillaryDB-Wax1469.Jiang and Kubota, 2001He, 2. K/min; Column length: 60. m; Column diameter: 0.25 mm; Tstart: 40. C; Tend: 220. C
CapillaryCarbowax 20M1465.Kasali, Oyedeji, et al., 200130. m/0.25 mm/0.25 μm, He, 4. K/min; Tstart: 50. C; Tend: 215. C
CapillaryBP-201473.Lota, de Rocca Serra, et al., 200150. m/0.22 mm/0.25 μm, He, 2. K/min, 230. C @ 35. min; Tstart: 60. C
CapillaryPEG-20M1480.Orav and Kann, 2001He, 2. K/min; Column length: 50. m; Column diameter: 0.2 mm; Tstart: 70. C; Tend: 220. C
CapillaryBP-201494.Bignell, Dunlop, et al., 199725. m/0.33 mm/0.5 μm, 5. K/min; Tstart: 80. C; Tend: 220. C
CapillaryCarbowax 20M1472.Tirado, Stashenko, et al., 199560. m/0.25 mm/0.25 μm, He, 50. C @ 10. min, 2. K/min, 150. C @ 20. min
CapillaryCarbowax 20M1477.Shibamoto and Jennings, 19771. K/min; Column length: 100. m; Column diameter: 0.25 mm; Tstart: 70. C; Tend: 170. C
CapillaryCarbowax 20M1477.Shibamoto and Jennings, 19771. K/min; Column length: 100. m; Column diameter: 0.25 mm; Tstart: 70. C; Tend: 170. C
PackedCarbowax 20M1491.Stancher and Pertoldi, 1967Hydrogen, Gas-Chrom Z (80-100 mesh), 4. K/min; Column length: 2. m; Tstart: 65. C; Tend: 220. C

Normal alkane RI, polar column, custom temperature program

View large format table.

Column type Active phase I Reference Comment
CapillarySupelco CO Wax-101483.Prompona, Kandylis, et al., 201260. m/0.32 mm/0.25 μm, Helium; Program: 35 0C (6 min) 2 0C/min -> 60 0C (5 min) 5 0C/min -> 200 0C 25 0C/min -> 250 0C (6 min)
CapillaryInnowax FSC1487.Kosar, Özek, et al., 200560. m/0.25 mm/0.25 μm, He; Program: 60C(10min) => 4C/min => 220C(10min) => 1C/min => 240C
CapillaryCarbowax 20M1465.Vinogradov, 2004Program: not specified
CapillaryFFAP1469.Buettner, Mestres, et al., 200330. m/0.32 mm/0.25 μm; Program: 35C (2min) => 40C/min => 60C (2min) => 6C/min => 180C => 10C/min => 230C (10min
CapillaryCarbowax 20M1472.Tirado, Stashenko, et al., 199560. m/0.25 mm/0.25 μm, He; Program: not specified
CapillaryCarbowax 20M1465.Shibamoto, 1987Program: not specified

References

Lecat, 1926
Lecat, M.,
New binary azeotropes: 3rd list,
Ann. Soc. Sci. Bruxelles, Ser. B, 1926, 45, 284-94. [all data]