Ethanamine, N-methyl-N-nitroso-
- Formula: C3H8N2O
- Molecular weight: 88.1084
- IUPAC Standard InChIKey: RTDCJKARQCRONF-UHFFFAOYSA-N
- CAS Registry Number: 10595-95-6
- Chemical structure:
View 3d structure (requires JavaScript / HTML 5) - Other names: Ethylamine, N-methyl-N-nitroso-; Ethylmethylnitrosamine; Methylethylnitrosamine; Methylethylnitrosoamine; N-Methyl-N-nitrosoethanamine; N-Methyl-N-nitrosoethylamine; N-Nitrosomethylethylamine; Nitrosomethylethylamine; Methylaethylnitrosamin; N,N-Methylethylnitrosamine; N-Methyl-N-nitroso-ethamine; NEMA; N-Nitrosoethylmethylamine; N-Nitroso-N-methylethylamine

Normal alkane RI, non-polar column, temperature ramp

Column type | Active phase | I | Reference | Comment |
---|---|---|---|---|
Capillary | OV-101 | 802. | Zenkevich, 2005 | 25. m/0.20 mm/0.10 μm, N2/He, 6. K/min; Tstart: 50. C; Tend: 250. C |

Lee's RI, non-polar column, temperature ramp

Column type | Active phase | I | Reference | Comment |
---|---|---|---|---|
Capillary | DB-5MS | 124.45 | Chen, Keeran, et al., 2002 | 30. m/0.25 mm/0.5 μm, 40. C @ 1. min, 10. K/min; Tend: 310. C |
Capillary | DB-5MS | 132.65 | Chen, Keeran, et al., 2002 | 30. m/0.25 mm/0.5 μm, 40. C @ 1. min, 4. K/min; Tend: 310. C |

References

Zenkevich, 2005
Zenkevich, I.G.,
Experimentally measured retention indices., 2005. [all data]
Chen, Keeran, et al., 2002
Chen, P.H.; Keeran, W.S.; Van Ausdale, W.A.; Schindler, D.R.; Roberts, D.W.,
Application of Lee retention indices to the confirmation of tentatively identified compounds from GC/MS analysis of environmental samples, Technical paper, Analytical Services Division, Environmental ScienceEngineering, Inc, PO Box 1703, Gainesville, FL 32602, 2002, 11. [all data]