Ethylene brassylate
- Formula: C15H26O4
- Molecular weight: 270.3645
- IUPAC Standard InChIKey: XRHCAGNSDHCHFJ-UHFFFAOYSA-N
- CAS Registry Number: 105-95-3
- Chemical structure:
View 3d structure (requires JavaScript / HTML 5) - Other names: 1,4-Dioxacycloheptadecane-5,17-dione; Astratone; Ethylene undecane dicarboxylate; Musk T; Tridecanedioic acid, cyclic ethylene ester; 1,11-Undecanedicarboxylic acid, ester with ethylene glycol; Emeressence 1150

Kovats' RI, non-polar column, isothermal

Column type | Active phase | Temperature (C) | I | Reference | Comment |
---|---|---|---|---|---|
Capillary | SE-30 | 100. | 1988.6 | Tudor, 1997 | 40. m/0.35 mm/0.35 μm |

References

Tudor, 1997
Tudor, E.,
Temperature dependence of the retention index for perfumery compounds on a SE-30 glass capillary column. I. Linear equations,
J. Chromatogr. A, 1997, 779, 1-2, 287-297, https://doi.org/10.1016/S0021-9673(97)00453-6
. [all data]