4-Chloro-N-(2-methyl-4-nitrophenyl)-benzenesulfonamide
- Formula: C13H11ClN2O4S
- Molecular weight: 326.755
- IUPAC Standard InChIKey: CNZQESBPARGYEP-UHFFFAOYSA-N
- CAS Registry Number: 10589-64-7
- Chemical structure:
View 3d structure (requires JavaScript / HTML 5) - Permanent link for this species. Use this link for bookmarking this species for future reference.

Van Den Dool and Kratz RI, non-polar column, temperature ramp

Column type | Active phase | I | Reference | Comment |
---|---|---|---|---|
Capillary | VF-5MS | 2757. | Todua, 2011 | 30. m/0.25 mm/0.25 μm, He; Tstart: 60. C; Tend: 270. C |

References

Todua, 2011
Todua, N.G.,
Retention Data. NIST Mass Spectrometry Data Center., NIST Mass Spectrometry Data Center, 2011. [all data]