Pentanoic acid, 2-methylpropyl ester
- Formula: C9H18O2
- Molecular weight: 158.2380
- IUPAC Standard InChIKey: ADNADZOSMJDVIS-UHFFFAOYSA-N
- CAS Registry Number: 10588-10-0
- Chemical structure:
View 3d structure (requires JavaScript / HTML 5) - Other names: Valeric acid, isobutyl ester; Isobutyl valerate; Isobutyl valerinate; 2-Methyl-1-propyl n-valerate; 2-Methylpropyl valerate; Isobutyl pentanoate

Gas phase thermochemistry data

Data compiled by: Hussein Y. Afeefy, Joel F. Liebman, and Stephen E. Stein
Quantity | Value | Units | Method | Reference | Comment |
---|---|---|---|---|---|
ΔfH°gas | -569. ± 4. | kJ/mol | Ccb | Schjanberg, 1937 | Heat of formation derived by Cox and Pilcher, 1970 |

Condensed phase thermochemistry data

Data compiled by: Hussein Y. Afeefy, Joel F. Liebman, and Stephen E. Stein
Quantity | Value | Units | Method | Reference | Comment |
---|---|---|---|---|---|
ΔfH°liquid | -620. ± 3. | kJ/mol | Ccb | Schjanberg, 1937 | Heat of formation derived by Cox and Pilcher, 1970 |
Quantity | Value | Units | Method | Reference | Comment |
ΔcH°liquid | -5486.5 ± 3.3 | kJ/mol | Ccb | Schjanberg, 1937 | Reanalyzed by Cox and Pilcher, 1970, Original value = -5486. ± 8. kJ/mol; At 293 K; Corresponding ΔfHºliquid = -627.60 kJ/mol (simple calculation by NIST; no Washburn corrections) |

Phase change data

Data compiled as indicated in comments:
ALS - Hussein Y. Afeefy, Joel F. Liebman, and Stephen E. Stein
DRB - Donald R. Burgess, Jr.
Quantity | Value | Units | Method | Reference | Comment |
---|---|---|---|---|---|
ΔvapH° | 51. ± 1. | kJ/mol | E | Schjanberg, 1937 | Heat of formation derived by Cox and Pilcher, 1970; ALS |
ΔvapH° | 51.0 | kJ/mol | N/A | Schjanberg, 1937 | DRB |
Enthalpy of vaporization
ΔvapH (kJ/mol) | Temperature (K) | Method | Reference | Comment |
---|---|---|---|---|
41. | 293. | V | Schjanberg, 1937 | At 293 K; ALS |

Kovats' RI, non-polar column, isothermal

Column type | Active phase | Temperature (C) | I | Reference | Comment |
---|---|---|---|---|---|
Packed | SE-30 | 150. | 1027. | Ashes and Haken, 1974 | Celaton (62-72 mesh); Column length: 3.7 m |
Packed | SE-30 | 150. | 1009. | Ashes and Haken, 1974 | Celaton (62-72 mesh); Column length: 3.7 m |
Packed | SE-30 | 100. | 1036. | Chastrette, Heintz, et al., 1974 | N2, Chromosorb W AW (60-80 mesh); Column length: 3. m |
Packed | SE-30 | 150. | 1027. | Germaine and Haken, 1969 | Celite 560; Column length: 3.7 m |

Kovats' RI, non-polar column, custom temperature program

Column type | Active phase | I | Reference | Comment |
---|---|---|---|---|
Capillary | SE-30 | 1027. | Chretien and Dubois, 1978 | Program: not specified |
Capillary | SE-30 | 1009. | Chretien and Dubois, 1978 | Program: not specified |

Kovats' RI, polar column, isothermal

Column type | Active phase | Temperature (C) | I | Reference | Comment |
---|---|---|---|---|---|
Packed | Carbowax 20M | 100. | 1253. | Chastrette, Heintz, et al., 1974 | Chromosorb WAW (60-80 mesh); Column length: 3. m |

Normal alkane RI, non-polar column, temperature ramp

Column type | Active phase | I | Reference | Comment |
---|---|---|---|---|
Capillary | DB-5 | 1044. | Scrivanti, Anton, et al., 2009 | 30. m/0.25 mm/0.25 μm, Nitrogen, 2. K/min; Tstart: 40. C; Tend: 230. C |

Normal alkane RI, non-polar column, custom temperature program

Column type | Active phase | I | Reference | Comment |
---|---|---|---|---|
Capillary | SE-30 | 1027. | Liu, Liang, et al., 2007 | Program: not specified |
Capillary | SE-30 | 1040. | Vinogradov, 2004 | Program: not specified |

Normal alkane RI, polar column, custom temperature program

Column type | Active phase | I | Reference | Comment |
---|---|---|---|---|
Capillary | Carbowax 20M | 1252. | Vinogradov, 2004 | Program: not specified |

References

Schjanberg, 1937
Schjanberg, E.,
Die verbrennungswarmen und die refraktionsdaten einiger pentensaureeste,
Z. Phys. Chem., 1937, 178, 274-281. [all data]
Cox and Pilcher, 1970
Cox, J.D.; Pilcher, G.,
Thermochemistry of Organic and Organometallic Compounds, Academic Press, New York, 1970, 1-636. [all data]
Ashes and Haken, 1974
Ashes, J.R.; Haken, J.K.,
Gas chromatography of homologous esters. VI. Structure-retention increments of aliphatic esters,
J. Chromatogr., 1974, 101, 1, 103-123, https://doi.org/10.1016/S0021-9673(01)94737-5
. [all data]
Chastrette, Heintz, et al., 1974
Chastrette, M.; Heintz, M.; Druilhe, A.; Lefort, D.,
Analyse chromatographique d'esters aliphatiques saturés. Relations rétention-structure et prévision de la rétention,
Bull. Soc. Chim. Fr., 1974, 9/10,Pt.1, 1852-1856. [all data]
Germaine and Haken, 1969
Germaine, R.W.; Haken, J.K.,
Gas chromatography of homologous esters. Part 1. Simple aliphatic esters,
J. Chromatogr., 1969, 43, 33-42, https://doi.org/10.1016/S0021-9673(00)99162-3
. [all data]
Chretien and Dubois, 1978
Chretien, J.R.; Dubois, J-E.,
Topological Analysis: A Technique for the Physico-Chemical Exploitation of Retention Data in Gas-Liquid Chromatography,
J. Chromatogr., 1978, 158, 43-56, https://doi.org/10.1016/S0021-9673(00)89954-9
. [all data]
Scrivanti, Anton, et al., 2009
Scrivanti, L.R.; Anton, A.M.; Zygadlo, J.A.,
Essential oil conposition of Bothriochloa Kuntze (Poaceae) from South America and their chemotaxonomy,
Biochem. Systematics Ecol., 2009, 37, 3, 206-213, https://doi.org/10.1016/j.bse.2009.03.009
. [all data]
Liu, Liang, et al., 2007
Liu, F.; Liang, Y.; Cao, C.; Zhou, N.,
QSPR study of GC retention indices for saturated esters on seven stationary phases based on novel topological indices,
Talanta, 2007, 72, 4, 1307-1315, https://doi.org/10.1016/j.talanta.2007.01.038
. [all data]
Vinogradov, 2004
Vinogradov, B.A.,
Production, composition, properties and application of essential oils, 2004, retrieved from http://viness.narod.ru. [all data]