Geranyl acetate
- Formula: C12H20O2
- Molecular weight: 196.2860
- IUPAC Standard InChIKey: HIGQPQRQIQDZMP-DHZHZOJOSA-N
- CAS Registry Number: 105-87-3
- Chemical structure:
View 3d structure (requires JavaScript / HTML 5) - Species with the same structure:
- Stereoisomers:
- Other names: 2,6-Octadien-1-ol, 3,7-dimethyl-, acetate, (E)-; Acetic acid, geraniol ester; Bay pine (oyster) oil; Geraniol acetate; trans-3,7-Dimethyl-2,6-octadien-1-ol, acetate; NCI-C54728; 2,6-Octadien-1-ol, 3,7-dimethyl-, acetate, trans-; 3,7-Dimethyl-2-trans, 6-octadienyl acetate; trans-3,7-Dimethyl-2,6-octadien-1-yl acetate; trans-2,6-Dimethyl-2,6-octadien-8-yl ethanoate; Geranyl ethanoate; (E)-3,7-Dimethyl-2,6-octadien-1-yl acetate; Meraneine; trans-Geranyl acetate; 2,6-Octadien-1-ol, 3,7-dimethyl-, 1-acetate, (2E)-; 2,6-Octadien-1-ol, 3,7-dimethyl-, acetate, (2E)-; NSC 2584; (2E)-3,7-Dimethyl-2,6-octadienyl acetate; (E)-3,7-Dimethyl-2,6-octadien-1-ol acetate

Phase change data

Data compiled as indicated in comments:
BS - Robert L. Brown and Stephen E. Stein
AC - William E. Acree, Jr., James S. Chickos
Reduced pressure boiling point
Tboil (K) | Pressure (atm) | Reference | Comment |
---|---|---|---|
411.2 | 0.033 | Aldrich Chemical Company Inc., 1990 | BS |
Enthalpy of vaporization
ΔvapH (kcal/mol) | Temperature (K) | Method | Reference | Comment |
---|---|---|---|---|
13.9 | 361. | A | Stephenson and Malanowski, 1987 | Based on data from 346. to 516. K. See also Stull, 1947.; AC |
Antoine Equation Parameters
log10(P) = A − (B / (T + C))
P = vapor pressure (atm)
T = temperature (K)
View plot Requires a JavaScript / HTML 5 canvas capable browser.
Temperature (K) | A | B | C | Reference | Comment |
---|---|---|---|---|---|
346.7 to 516.5 | 5.44308 | 2673.055 | -25.54 | Stull, 1947 | Coefficents calculated by NIST from author's data. |

Kovats' RI, non-polar column, isothermal

Column type | Active phase | Temperature (C) | I | Reference | Comment |
---|---|---|---|---|---|
Capillary | SE-30 | 100. | 1359.7 | Tudor, 1997 | 40. m/0.35 mm/0.35 μm |
Capillary | SF-96 | 135. | 1363. | Sakai, Maarse, et al., 1967 | Column length: 152. m; Column diameter: 0.8 mm |

Kovats' RI, non-polar column, temperature ramp

Column type | Active phase | I | Reference | Comment |
---|---|---|---|---|
Capillary | DB-1 | 1363. | Allegrone, Belliardo, et al., 2006 | 30. m/0.25 mm/0.25 μm, He, 50. C @ 3. min, 5. K/min; Tend: 280. C |
Capillary | HP-5MS | 1392. | Hazzit, Baaliouamer, et al., 2006 | 30. m/0.25 mm/0.25 μm, He, 60. C @ 8. min, 2. K/min, 280. C @ 30. min |
Capillary | HP-5MS | 1386. | Jalali-Heravi, Zekavat, et al., 2006 | 60. m/0.25 mm/0.25 μm, He, 40. C @ 1. min, 3. K/min, 250. C @ 20. min |
Capillary | DB-5MS | 1354. | Marongiu, Porcedda, et al., 2006 | 30. m/0.25 mm/0.25 μm, He, 3. K/min, 280. C @ 30. min; Tstart: 60. C |
Capillary | HP-5 | 1386. | Oliveira, Leitao, et al., 2006 | 25. m/0.2 mm/0.33 μm, 3. K/min; Tstart: 60. C; Tend: 240. C |
Capillary | CP Sil 8 CB | 1376. | Tayoub, Schwob, et al., 2006 | 30. m/0.25 mm/0.25 μm, H2, 50. C @ 2. min, 3. K/min; Tend: 220. C |
Capillary | CP Sil 8 CB | 1376. | Tayoub, Schwob, et al., 2006, 2 | 30. m/0.25 mm/0.25 μm, H2, 50. C @ 2. min, 3. K/min; Tend: 220. C |
Capillary | DB-5 | 1381. | Adams, Morris, et al., 2005 | 30. m/0.26 mm/0.25 μm, He, 3. K/min; Tstart: 60. C; Tend: 246. C |
Capillary | HP-5MS | 1383. | Asuming, Beauchamp, et al., 2005 | 30. m/0.25 mm/0.25 μm, He, 50. C @ 10. min, 3. K/min, 250. C @ 5. min |
Capillary | BP-5 | 1389. | Baranauskiene, Venskutonis, et al., 2005 | 50. m/0.32 mm/0.25 μm, He, 50. C @ 2. min, 5. K/min, 260. C @ 5. min |
Capillary | BP-1 | 1356. | Rajeswara Rao, Kaul, et al., 2005 | 30. m/0.32 mm/0.25 μm, 5. K/min, 245. C @ 10. min; Tstart: 60. C |
Capillary | BP-1 | 1356. | Rao, Kaul, et al., 2005 | 30. m/0.32 mm/0.25 μm, 5. K/min, 245. C @ 10. min; Tstart: 60. C |
Capillary | DB-5 | 1372. | Avato, Raffo, et al., 2004 | 30. m/0.25 mm/0.25 μm, H2, 4. K/min, 280. C @ 30. min; Tstart: 40. C |
Capillary | CP Sil 5 CB | 1360. | Ogunwande, Olawore, et al., 2004 | 25. m/0.25 mm/0.15 μm, H2, 3. K/min; Tstart: 50. C; Tend: 230. C |
Capillary | SPB-1 | 1370. | Yadav, Chauhan, et al., 2004 | 30. m/0.32 mm/0.25 μm, He, 50. C @ 2. min, 2. K/min, 250. C @ 5. min |
Capillary | DB-5 | 1390. | Baranauskiene, Venskutonis, et al., 2003 | 50. m/0.32 mm/0.25 μm, He, 50. C @ 2. min, 5. K/min, 280. C @ 10. min |
Capillary | HP-5 | 1386. | Bouzouita, Kachouri, et al., 2003 | 30. m/0.25 mm/1. μm, He, 40. C @ 1. min, 5. K/min; Tend: 250. C |
Capillary | BP-1 | 1368. | Srivastava, Ahmad, et al., 2003 | 25. m/0.55 mm/0.25 μm, N2, 5. K/min, 220. C @ 15. min; Tstart: 60. C |
Capillary | DB-1 | 1392. | Mevy, Bessiere, et al., 2002 | He, 3. K/min; Column length: 25. m; Column diameter: 0.2 mm; Tstart: 60. C; Tend: 220. C |
Capillary | BP-1 | 1359. | Raina, Srivastava, et al., 2002 | 25. m/0.55 mm/0.25 μm, N2, 5. K/min, 220. C @ 15. min; Tstart: 60. C |
Capillary | BP-1 | 1362. | Rajeswara Rao, 2002 | 25. m/0.5 mm/0.25 μm, N2, 5. K/min, 220. C @ 10. min; Tstart: 60. C |
Capillary | BP-1 | 1362. | Rao B.R.R., 2002 | 25. m/0.5 mm/0.25 μm, 5. K/min, 220. C @ 10. min; Tstart: 60. C |
Capillary | DB-5 | 1384. | Akrout, Chemli, et al., 2001 | 25. m/0.20 mm/0.25 μm, He, 5. K/min; Tstart: 50. C; Tend: 240. C |
Capillary | BP-1 | 1359. | Jain, Aggarwal, et al., 2001 | 25. m/0.55 mm/0.25 μm, N2, 5. K/min, 220. C @ 15. min; Tstart: 60. C |
Capillary | HP-1 | 1358. | Rajeswara Rao, 2001 | 25. m/0.2 mm/0.25 μm, He, 4. K/min; Tstart: 100. C; Tend: 220. C |
Capillary | DB-5 | 1383. | Adams, 2000 | 30. m/0.26 mm/0.25 μm, He, 3. K/min; Tstart: 60. C; Tend: 240. C |
Capillary | BP-1 | 1362. | Rao, Kaul, et al., 2000 | N2, 5. K/min, 220. C @ 10. min; Column length: 25. m; Column diameter: 0.5 mm; Tstart: 60. C |
Capillary | DB-5 | 1391. | Rao, Rout, et al., 2000 | He, 2. K/min; Column length: 30. m; Column diameter: 0.25 mm; Tstart: 60. C; Tend: 180. C |
Capillary | BP-1 | 1362. | Rao, Sastry, et al., 2000 | 25. m/0.50 mm/0.25 μm, N2, 5. K/min, 220. C @ 10. min; Tstart: 60. C |
Capillary | DB-5 | 1383. | Adams, 1999 | 30. m/0.26 mm/0.25 μm, He, 3. K/min; Tstart: 60. C; Tend: 246. C |
Capillary | HP-5 | 1383. | Sajjadi and Ghassemi, 1999 | 30. m/0.25 mm/0.25 μm, He, 4. K/min; Tstart: 60. C; Tend: 280. C |
Capillary | BP-1 | 1359. | Vera and Chane-Ming, 1999 | 50. m/0.25 mm/0.25 μm, 2. K/min; Tstart: 60. C; Tend: 260. C |
Capillary | BP-1 | 1364. | Vera and Chane-Ming, 1999 | 50. m/0.25 mm/0.25 μm, 2. K/min; Tstart: 60. C; Tend: 260. C |
Capillary | DB-1 | 1358. | Bylaite, Venskutonis, et al., 1998 | 60. m/0.25 mm/0.25 μm, He, 50. C @ 5. min, 3. K/min, 250. C @ 10. min |
Capillary | CP Sil 5 CB | 1360. | Kaul and Vats, 1998 | 5. K/min; Column length: 25. m; Column diameter: 0.25 mm; Tstart: 60. C; Tend: 280. C |
Capillary | BP-1 | 1357. | Kulkarni, Mallavarapu, et al., 1998 | N2, 5. K/min; Column length: 25. m; Column diameter: 0.25 mm; Tstart: 60. C; Tend: 220. C |
Capillary | Methyl Silicone | 1362. | Mallavarapu, Rao, et al., 1998 | N2, 5. K/min; Column length: 25. m; Column diameter: 0.5 mm; Tstart: 60. C; Tend: 220. C |
Capillary | OV-1 | 1365. | Afsharypuor, Asgary, et al., 1996 | 30. m/0.31 mm/3. μm, He, 10. K/min; Tstart: 70. C; Tend: 280. C |
Capillary | SE-30 | 1359. | Jantan, Ahmad, et al., 1996 | N2, 60. C @ 10. min, 3. K/min, 180. C @ 1. min; Column length: 25. m; Column diameter: 0.2 mm |
Capillary | SE-30 | 1363. | Jantan, Ali, et al., 1995 | N2, 60. C @ 10. min, 3. K/min, 180. C @ 1. min; Column length: 25. m; Column diameter: 0.2 mm |
Capillary | DB-5 | 1385. | Loayza, Abujder, et al., 1995 | 40. C @ 2. min, 2. K/min, 210. C @ 120. min; Column length: 30. m |
Capillary | OV-101 | 1360. | Gaydou, Randriamiharisoa, et al., 1986 | 100. m/0.3 mm/0.15 μm, H2, 2. K/min; Tstart: 90. C; Tend: 220. C |

Kovats' RI, non-polar column, custom temperature program

Column type | Active phase | I | Reference | Comment |
---|---|---|---|---|
Capillary | HP-5 | 1378. | de Marchese, de Heluani, et al., 2007 | He; Program: 60C(5min) => 3C/min => 100C => 1C/min => 160C => 10C/min => 240C(10min) |
Capillary | SPB-1 | 1360. | Riu-Aumatell, Castellari, et al., 2004 | 30. m/0.25 mm/0.25 μm; Program: not specified |
Capillary | HP-5 | 1385. | Sibanda, Chigwada, et al., 2004 | 30. m/0.25 mm/0.25 μm, He; Program: 40C(10min) => 3C/min => 200C => 2C/min => 220C |
Capillary | HP-5 | 1381. | Daferera, Ziogas, et al., 2003 | 30. m/0.25 mm/0.25 μm, He; Program: 40C (3min) => 3C/min => 180C => 30C/min => 270C (5min) |
Capillary | BP-1 | 1362. | Khan, Srivastava, et al., 2003 | 25. m/0.25 mm/0.25 μm, N2; Program: 60C => 5C/min => 220C (5min) => 3C/min => 245 C (5min) |
Capillary | BP-1 | 1364. | Raina, Srivastava, et al., 2003 | 25. m/0.32 mm/0.25 μm, N2; Program: 60C => 5C/min => 220C(5min) => 3C/min => 245C(5min) |
Capillary | BP-1 | 1356. | Rao, Kaul, et al., 2003 | 30. m/0.32 mm/0.25 μm, N2; Program: 60C => 5.5C/min => 220C => 3.5C/min => 245C |
Capillary | HP-5 | 1383. | Shellie and Marriott, 2003 | 30. m/0.25 mm/0.25 μm, He; Program: not specified |
Capillary | SPB-1 | 1358. | Borse, Jagan Mohan Rao, et al., 2002 | 30. m/0.32 mm/0.25 μm, He; Program: 40C(3min) => 2C/min => 100C => 4C/min => 220C (7min) |
Capillary | BP-1 | 1362. | Khan, Srivastava, et al., 2002 | 30. m/0.32 mm/0.25 μm, N2; Program: 60 C 5 C/min -> 220 C (5 min) 3 C/min -> 245 C (5 min) |
Capillary | DB-5 | 1393. | Rao, Rout, et al., 2000 | He; Column length: 30. m; Column diameter: 0.25 mm; Program: not specified |
Capillary | DB-5 | 1383. | Adams, 1998 | 30. m/0.26 mm/0.25 μm; Program: not specified |

Kovats' RI, polar column, isothermal

Column type | Active phase | Temperature (C) | I | Reference | Comment |
---|---|---|---|---|---|
Capillary | Carbowax 20M | 150. | 1779. | Tudor, Moldovan, et al., 1999 | Phase thickness: 0.45 μm |
Capillary | Carbowax 20M | 150. | 1759. | Tudor, Moldovan, et al., 1999 | Phase thickness: 0.08 μm |
Packed | Carbowax 20M | 150. | 1765. | ter Heide, 1968 | N2, Embacel; Column length: 2.5 m |
Packed | Carbowax 20M | 150. | 1765. | ter Heide, 1968 | N2, Embacel; Column length: 2.5 m |
Capillary | Carbowax 20M + Igepal (20:1) | 135. | 1754. | Sakai, Maarse, et al., 1967 | He, GAS PAK F; Column length: 152. m; Column diameter: 0.8 mm |

Kovats' RI, polar column, temperature ramp

Column type | Active phase | I | Reference | Comment |
---|---|---|---|---|
Capillary | Stabilwax | 1778. | Hazzit, Baaliouamer, et al., 2006 | 30. m/0.32 mm/1. μm, N2, 50. C @ 3. min, 2. K/min, 220. C @ 15. min |
Capillary | DB-Wax | 1731. | Avato, Raffo, et al., 2004 | 30. m/0.25 mm/0.25 μm, H2, 40. C @ 2. min, 4. K/min, 260. C @ 15. min |
Capillary | Supelcowax | 1745. | Riu-Aumatell, Castellari, et al., 2004 | 30. m/0.25 mm/0.25 μm, 60. C @ 5. min, 3. K/min, 240. C @ 10. min |
Capillary | Supelcowax | 1745. | Riu-Aumatell, Castellari, et al., 2004 | 30. m/0.25 mm/0.25 μm, 60. C @ 5. min, 3. K/min, 240. C @ 10. min |
Capillary | Carbowax 20M | 1728. | Vera and Chane-Ming, 1999 | 50. m/0.32 mm/0.2 μm, 2. K/min; Tstart: 60. C; Tend: 260. C |
Capillary | Carbowax 20M | 1735. | Vera and Chane-Ming, 1999 | 50. m/0.32 mm/0.2 μm, 2. K/min; Tstart: 60. C; Tend: 260. C |
Capillary | Carbowax 20M | 1754. | Kulkarni, Mallavarapu, et al., 1998 | N2, 5. K/min; Column length: 25. m; Column diameter: 0.25 mm; Tstart: 60. C; Tend: 200. C |
Capillary | Carbowax 20M | 1763. | Mallavarapu, Rao, et al., 1998 | N2, 5. K/min; Column length: 25. m; Column diameter: 0.5 mm; Tstart: 60. C; Tend: 200. C |
Capillary | Supelcowax-10 | 1751. | Loayza, Abujder, et al., 1995 | 40. C @ 2. min, 2. K/min, 210. C @ 120. min; Column length: 30. m |
Capillary | DB-Wax | 1756. | Umano, Hagi, et al., 1994 | He, 40. C @ 2. min, 2. K/min; Column length: 60. m; Column diameter: 0.25 mm; Tend: 200. C |
Capillary | Carbowax 20M | 1755. | Randriamiharisoa and Gaydou, 1987 | He, 2. K/min; Column length: 50. m; Column diameter: 0.3 mm; Tstart: 70. C; Tend: 210. C |
Capillary | Carbowax 20M | 1734. | Gaydou, Randriamiharisoa, et al., 1986 | 50. m/0.3 mm/0.15 μm, H2, 2. K/min; Tstart: 70. C; Tend: 210. C |

Van Den Dool and Kratz RI, non-polar column, temperature ramp

Column type | Active phase | I | Reference | Comment |
---|---|---|---|---|
Capillary | Equity-5MS | 1377. | Belsito E.L., Carbone C., et al., 2007 | 30. m/0.25 mm/0.25 μm, He, 3. K/min, 250. C @ 10. min; Tstart: 50. C |
Capillary | HP-5 | 1383. | Benzo, Gilardoni, et al., 2007 | 30. m/0.25 mm/0.25 μm, He, 40. C @ 1. min, 5. K/min, 250. C @ 10. min |
Capillary | HP-5 | 1388. | Dehghan, Solaimanian, et al., 2007 | 25. m/0.25 mm/0.25 μm, He, 60. C @ 2. min, 4. K/min; Tend: 240. C |
Capillary | BP-1 | 1360. | Duquesnoy, Castola, et al., 2007 | 50. m/0.22 mm/0.25 μm, He, 2. K/min, 220. C @ 20. min; Tstart: 60. C |
Capillary | HP-5 | 1385. | Flamini, Tebano, et al., 2007 | 30. m/0.25 mm/0.25 μm, N2, 50. C @ 10. min, 5. K/min; Tend: 220. C |
Capillary | RTX-1 | 1358. | Paolini J., Costa J., et al., 2007 | 60. m/0.22 mm/0.25 μm, He, 2. K/min, 230. C @ 35. min; Tstart: 60. C |
Capillary | DB-5 | 1382. | Silva, Barbosa, et al., 2007 | 30. m/0.22 mm/0.25 μm, He, 55. C @ 2. min, 3. K/min, 240. C @ 15. min |
Capillary | DB-5 | 1379. | Dob, Dahmane, et al., 2006 | 30. m/0.25 mm/0.25 μm, N2, 60. C @ 3. min, 3. K/min, 240. C @ 3. min |
Capillary | BP-1 | 1358. | Gonny, Cavaleiro, et al., 2006 | 50. m/0.22 mm/0.25 μm, He, 2. K/min, 220. C @ 20. min; Tstart: 60. C |
Capillary | SPB-1 | 1359. | Pinto, Pina-Vaz, et al., 2006 | 30. m/0.2 mm/0.2 μm, He, 3. K/min, 220. C @ 15. min; Tstart: 70. C |
Capillary | SPB-1 | 1360. | Radulovic, Mananjarasoa, et al., 2006 | 30. m/0.25 mm/0.25 μm, He, 50. C @ 3. min, 5. K/min, 250. C @ 15. min |
Capillary | SPB-1 | 1359. | Salgueiro L.R., Pinto E., et al., 2006 | 30. m/0.2 mm/0.2 μm, He, 3. K/min, 220. C @ 15. min; Tstart: 70. C |
Capillary | HP-5MS | 1385. | Saroglou, Dorizas, et al., 2006 | 30. m/0.25 mm/0.25 μm, He, 60. C @ 5. min, 4. K/min; Tend: 280. C |
Capillary | DB-5 | 1381. | Su, Ho, et al., 2006 | 30. m/0.25 mm/0.25 μm, He, 50. C @ 2. min, 5. K/min; Tend: 250. C |
Capillary | DB-5 | 1381. | Su, Ho, et al., 2006, 2 | 30. m/0.25 mm/0.25 μm, He, 50. C @ 2. min, 5. K/min; Tend: 250. C |
Capillary | HP-5MS | 1376. | Vujisic L., Vuckovic I., et al., 2006 | 30. m/0.25 mm/0.25 μm, H2, 4.3 K/min; Tstart: 50. C; Tend: 285. C |
Capillary | SPB-1 | 1365. | Boskovic, Radulovic, et al., 2005 | 30. m/0.25 mm/0.25 μm, He, 50. C @ 3. min, 5. K/min, 250. C @ 15. min |
Capillary | DB-5 | 1379. | Boskovic, Radulovic, et al., 2005 | 30. m/0.2 mm/0.25 μm, He, 50. C @ 3. min, 5. K/min, 250. C @ 15. min |
Capillary | RTX-1 | 1360. | Cozzani, Muselli, et al., 2005 | 60. m/0.22 mm/0.25 μm, 2. K/min, 220. C @ 20. min; Tstart: 60. C |
Capillary | DB-1 | 1355. | Dob, Berramdane, et al., 2005 | 30. m/0.32 mm/0.25 μm, N2, 50. C @ 3. min, 2. K/min, 260. C @ 5. min |
Capillary | DB-1 | 1388. | Dob T., Berramdane T., et al., 2005 | 30. m/0.32 mm/0.25 μm, N2, 50. C @ 3. min, 2. K/min, 260. C @ 5. min |
Capillary | DB-1 | 1363. | Dob, Dahmane, et al., 2005 | 30. m/0.32 mm/0.25 μm, 50. C @ 8. min, 2. K/min; Tend: 250. C |
Capillary | MDN-5 | 1375. | Dugo, Mondello, et al., 2005 | 30. m/0.25 mm/0.25 μm, He, 3. K/min; Tstart: 50. C; Tend: 250. C |
Capillary | DB-1 | 1363. | Fanciullino, Gancel, et al., 2005 | 30. m/0.25 mm/0.25 μm, He, 3. K/min, 250. C @ 20. min; Tstart: 40. C |
Capillary | BP-1 | 1358. | Ferrari, Tomi, et al., 2005 | 50. m/0.22 mm/0.25 μm, He, 2. K/min, 220. C @ 20. min; Tstart: 60. C |
Capillary | DB-1 | 1358. | Gancel, Ollitrault, et al., 2005 | 30. m/0.25 mm/0.25 μm, He, 3. K/min, 250. C @ 20. min; Tstart: 40. C |
Capillary | CP Sil 5 CB | 1363. | Idzojtic, Kajba, et al., 2005 | 50. m/0.22 mm/0.13 μm, H2, 4. K/min, 300. C @ 10. min; Tstart: 40. C |
Capillary | RTX-1 | 1358. | Paolini, Costa, et al., 2005 | 60. m/0.22 mm/0.25 μm, He, 2. K/min, 230. C @ 35. min; Tstart: 60. C |
Capillary | HP-5MS | 1383. | Pino, Mesa, et al., 2005 | 30. m/0.25 mm/0.25 μm, He, 60. C @ 2. min, 4. K/min, 250. C @ 20. min |
Capillary | HP-5MS | 1384. | Smadja, Rondeau, et al., 2005 | 60. m/0.2 mm/0.25 μm, He, 2. K/min, 200. C @ 10. min; Tstart: 60. C |
Capillary | Mega 5MS | 1379. | Verzera, Trozzi, et al., 2005 | 30. m/0.25 mm/0.25 μm, He, 40. C @ 2. min, 3. K/min; Tend: 240. C |
Capillary | HP-5 | 1364. | Bertoli, Pistelli, et al., 2004 | 30. m/0.25 mm/0.25 μm, N2, 60. C @ 10. min, 5. K/min; Tend: 220. C |
Capillary | HP-5MS | 1379. | Chorianopoulos, Kalpoutzakis, et al., 2004 | 30. m/0.25 mm/0.25 μm, He, 3. K/min; Tstart: 60. C; Tend: 280. C |
Capillary | RTX-5 | 1383. | Dugo, Mondello, et al., 2004 | 30. m/0.25 mm/0.25 μm, He, 45. C @ 6. min, 3. K/min, 300. C @ 10. min |
Capillary | DB-5 | 1383. | Javidnia, Miri, et al., 2004 | 30. m/0.25 mm/0.25 μm, He, 3. K/min; Tstart: 60. C; Tend: 260. C |
Capillary | HP-5MS | 1379. | Karioti, Hadjipavlou-Litina, et al., 2004 | 30. m/0.25 mm/0.25 μm, He, 60. C @ 5. min, 4. K/min; Tend: 280. C |
Capillary | DB-5MS | 1383. | Mardarowicz, Wianowska, et al., 2004 | 30. m/0.25 mm/0.25 μm, He, 40. C @ 2. min, 4. K/min; Tend: 280. C |
Capillary | SPB-1 | 1359. | Moldão-Martins, Beirão-da-Costa, et al., 2004 | 30. m/0.2 mm/0.2 μm, He, 3. K/min, 220. C @ 15. min; Tstart: 70. C |
Capillary | RSL-200 | 1354. | Ngassoum, Ousmaila, et al., 2004 | 30. m/0.32 mm/0.25 μm, H2, 40. C @ 5. min, 6. K/min, 280. C @ 5. min |
Capillary | BP-1 | 1357. | Raina, Kumar, et al., 2004 | 30. m/0.32 mm/0.25 μm, N2, 5. K/min, 220. C @ 13. min; Tstart: 60. C |
Capillary | HP-5 | 1379. | Sartoratto, Machado, et al., 2004 | 25. m/0.2 mm/0.33 μm, He, 3. K/min, 240. C @ 7. min; Tstart: 60. C |
Capillary | BP-1 | 1356. | Tam, Thuam, et al., 2004 | 50. m/0.22 mm/0.25 μm, He, 2. K/min, 220. C @ 20. min; Tstart: 60. C |
Capillary | SBP-5 | 1352. | Yoo, Kim, et al., 2004 | 60. m/0.25 mm/0.25 μm, Helium, 50. C @ 3. min, 5. K/min, 240. C @ 10. min |
Capillary | DB-5MS | 1379. | Yu, Kim, et al., 2004 | 30. m/0.25 mm/0.25 μm, He, 40. C @ 5. min, 4. K/min, 200. C @ 20. min |
Capillary | DB-5MS | 1384. | Yu, Kim, et al., 2004 | 30. m/0.25 mm/0.25 μm, He, 40. C @ 5. min, 4. K/min, 200. C @ 20. min |
Capillary | DB-5MS | 1381. | Yu, Kim, et al., 2004, 2 | 30. m/0.25 mm/0.25 μm, He, 40. C @ 5. min, 4. K/min, 200. C @ 20. min |
Capillary | DB-5MS | 1377. | Yu, Kim, et al., 2004, 2 | 30. m/0.25 mm/0.25 μm, He, 40. C @ 5. min, 4. K/min, 200. C @ 20. min |
Capillary | DB-1 | 1378. | Boyom, Assembe, et al., 2003 | 30. m/0.25 mm/0.25 μm, N2, 5. K/min, 200. C @ 0. min; Tstart: 50. C |
Capillary | SPB-1 | 1359. | Cavaleiro, Salgueiro, et al., 2003 | 30. m/0.2 mm/0.2 μm, He, 3. K/min, 220. C @ 15. min; Tstart: 70. C |
Capillary | SPB-1 | 1365. | Chisholm, Wilson, et al., 2003 | 25. m/0.25 mm/0.25 μm, 35. C @ 10. min, 4. K/min; Tend: 225. C |
Capillary | DB-1 | 1358. | de Feo, Urrunaga Soria, et al., 2003 | 30. m/0.25 mm/0.25 μm, He, 40. C @ 5. min, 2. K/min; Tend: 250. C |
Capillary | DB-1 | 1358. | Gancel, Ollitrault, et al., 2003 | 30. m/0.25 mm/0.25 μm, He, 3. K/min, 250. C @ 20. min; Tstart: 40. C |
Capillary | DB-5 | 1381. | bin Jantan, Yassin, et al., 2003 | 30. m/0.25 mm/0.25 μm, N2, 75. C @ 10. min, 3. K/min; Tend: 230. C |
Capillary | DB-5 | 1383. | Javidnia, Miri, et al., 2003 | He, 4. K/min; Column length: 25. m; Column diameter: 0.25 mm; Tstart: 60. C; Tend: 260. C |
Capillary | HP-5 | 1382. | Macchioni, Cioni, et al., 2003 | 30. m/0.25 mm/0.25 μm, He, 3. K/min; Tstart: 60. C; Tend: 240. C |
Capillary | HP-5 | 1388. | Shellie and Marriott, 2003 | 30. m/0.25 mm/0.25 μm, He, 3. K/min; Tstart: 40. C; Tend: 240. C |
Capillary | Mega 5MS | 1379. | Verzera, Trozzi, et al., 2003 | 30. m/0.25 mm/0.25 μm, He, 40. C @ 2. min, 3. K/min; Tend: 240. C |
Capillary | DB-5 | 1383. | Choi, Kim. M.-S.L., et al., 2002 | 30. m/0.25 mm/0.25 μm, He, 70. C @ 2. min, 4. K/min, 230. C @ 20. min |
Capillary | DB-5 | 1383. | Javidnia, Miri, et al., 2002 | 30. m/0.25 mm/0.25 μm, He, 4. K/min; Tstart: 60. C; Tend: 260. C |
Capillary | BP-1 | 1358. | Lota, de Rocca Serra, et al., 2002 | 50. m/0.22 mm/0.25 μm, He, 2. K/min, 220. C @ 20. min; Tstart: 60. C |
Capillary | RTX-5 | 1387. | Mondello, Zappia, et al., 2002 | 30. m/0.25 mm/0.25 μm, He, 45. C @ 6. min, 3. K/min, 300. C @ 10. min |
Capillary | HP-1 | 1362. | Nath, Sarma, et al., 2002 | 24. m/0.32 mm/0.17 μm, He, 60. C @ 2. min, 4. K/min, 250. C @ 20. min |
Capillary | CP Sil 5 CB | 1359. | Pino, Marbot, et al., 2002 | 25. m/0.25 mm/0.25 μm, N2, 60. C @ 6. min, 4. K/min; Tend: 280. C |
Capillary | CP Sil 5 CB | 1359. | Pino, Marbot, et al., 2002, 2 | 30. m/0.25 mm/0.25 μm, H2, 60. C @ 10. min, 2. K/min, 280. C @ 40. min |
Capillary | DB-1 | 1359. | Pintore, Usai, et al., 2002 | 50. m/0.22 mm/0.25 μm, He, 2. K/min, 220. C @ 20. min; Tstart: 60. C |
Capillary | HP-5 | 1359. | Pitarokili, Couladis, et al., 2002 | 30. m/0.25 mm/0.25 μm, He, 3. K/min; Tstart: 60. C; Tend: 280. C |
Capillary | RTX-5 | 1383. | Shellie, Mondello, et al., 2002 | 30. m/0.25 mm/0.25 μm, He, 45. C @ 6. min, 3. K/min; Tend: 250. C |
Capillary | RTX-5 | 1390. | Shellie, Mondello, et al., 2002 | 30. m/0.25 mm/0.25 μm, He, 45. C @ 6. min, 3. K/min; Tend: 250. C |
Capillary | HP-5 | 1383. | Aligiannis, Kalpoutzakis, et al., 2001 | 30. m/0.25 mm/0.25 μm, He, 60. C @ 5. min, 3. K/min; Tend: 280. C |
Capillary | HP-5 | 1377. | Couladis, Tsortanidou, et al., 2001 | 30. m/0.25 mm/0.25 μm, He, 3. K/min; Tstart: 60. C; Tend: 380. C |
Capillary | RTX-5 MS | 1353. | Hudaib, Grazia Bellardi, et al., 2001 | 30. m/0.25 mm/0.25 μm, He, 70. C @ 10. min, 4. K/min, 210. C @ 10. min |
Capillary | BP-1 | 1358. | Lota, Serra, et al., 2001 | 50. m/0.22 mm/0.25 μm, He, 2. K/min; Tstart: 60. C; Tend: 220. C |
Capillary | BP-1 | 1358. | Lota, Serra, et al., 2001 | 50. m/0.22 mm/0.25 μm, He, 2. K/min; Tstart: 60. C; Tend: 220. C |
Capillary | BP-1 | 1359. | Rezzi, Bighelli, et al., 2001 | 50. m/0.22 mm/0.25 μm, He, 2. K/min, 220. C @ 20. min; Tstart: 60. C |
Capillary | HP-5MS | 1380. | Skaltsa, Mavrommati, et al., 2001 | 30. m/0.25 mm/0.25 μm, He, 60. C @ 5. min, 4. K/min; Tend: 280. C |
Capillary | HP-5 | 1383. | Alonzo, Bosco, et al., 2000 | 30. m/0.20 mm/0.25 μm, He, 60. C @ 8. min, 4. K/min, 180. C @ 2. min |
Capillary | DB-5 | 1367. | Bartley and Jacobs, 2000 | 60. m/0.25 mm/0.25 μm, He, 40. C @ 2. min, 4. K/min, 290. C @ 5. min |
Capillary | BP-1 | 1358. | Lota, de Rocca Serra, et al., 2000 | 50. m/0.22 mm/0.25 μm, He, 2. K/min, 230. C @ 35. min; Tstart: 60. C |
Capillary | BP-1 | 1358. | Lota, de Rocca Serra, et al., 2000 | 50. m/0.22 mm/0.25 μm, He, 2. K/min, 230. C @ 35. min; Tstart: 60. C |
Capillary | RTX-5 | 1388. | Mondello, Zappia, et al., 2000 | 10. m/0.1 mm/0.1 μm, He, 12.3 K/min; Tstart: 50. C; Tend: 350. C |
Capillary | DB-5 | 1381. | Song, Sawamura, et al., 2000 | 30. m/0.25 mm/0.25 μm, N2, 2. K/min; Tstart: 70. C; Tend: 230. C |
Capillary | Mega 5MS | 1379. | Verzera, la Rosa, et al., 2000 | 30. m/0.25 mm/0.25 μm, He, 40. C @ 2. min, 3. K/min; Tend: 240. C |
Capillary | Mega 5MS | 1379. | Verzera, Trozzi, et al., 2000 | 30. m/0.25 mm/0.25 μm, He, 40. C @ 2. min, 3. K/min; Tend: 240. C |
Capillary | BP-1 | 1358. | Lota, Serra, et al., 1999 | 50. m/0.22 mm/0.25 μm, He, 2. K/min, 230. C @ 35. min; Tstart: 60. C |
Capillary | BP-1 | 1358. | Lota, Serra, et al., 1999 | 50. m/0.22 mm/0.25 μm, He, 2. K/min, 230. C @ 35. min; Tstart: 60. C |
Capillary | BP-1 | 1358. | Mazzoni, Tomi, et al., 1999 | 50. m/0.22 mm/0.25 μm, He, 2. K/min, 220. C @ 20. min; Tstart: 60. C |
Capillary | DB-1 | 1358. | Muselli, Hoi, et al., 1999 | 30. m/0.25 mm/0.25 μm, 50. C @ 3. min, 3. K/min; Tend: 220. C |
Capillary | Methyl Silicone | 1360. | Sumathykutty, Rao, et al., 1999 | 50. m/0.25 mm/0.17 μm, N2, 2. K/min; Tstart: 80. C; Tend: 200. C |
Capillary | DB-5 | 1384. | Isidorov, Zenkevich, et al., 1998 | 30. m/0.25 mm/0.25 μm, 3. K/min; Tstart: 50. C; Tend: 250. C |
Capillary | BP-1 | 1359. | Mariotti, Costa, et al., 1997 | 50. m/0.22 mm/0.25 μm, He, 2. K/min, 230. C @ 35. min; Tstart: 60. C |
Capillary | BP-1 | 1356. | Mariotti, Tomi, et al., 1997 | 50. m/0.22 mm/0.25 μm, He, 2. K/min, 230. C @ 35. min; Tstart: 60. C |
Capillary | DB-1 | 1366. | Stashenko, Prada, et al., 1996 | 60. m/0.25 mm/0.25 μm, He, 50. C @ 5. min, 3.5 K/min; Tend: 250. C |
Capillary | DB-5 | 1381. | Vahirua-Lechat, Menut, et al., 1996 | He, 2. K/min, 200. C @ 30. min; Column length: 30. m; Column diameter: 0.32 mm; Tstart: 80. C |
Capillary | Methyl Silicone | 1365. | Píry, Príbela, et al., 1995 | 25. m/0.2 mm/0.3 μm, He, 2. K/min; Tstart: 40. C; Tend: 200. C |
Capillary | DB-1 | 1366. | Bartley and Foley, 1994 | 60. m/0.32 mm/0.5 μm, 40. C @ 2. min, 4. K/min, 290. C @ 5. min |
Capillary | DB-5 | 1377. | Gómez, Ledbetter, et al., 1993 | He, 4. K/min; Column length: 30. m; Column diameter: 0.25 mm; Tstart: 50. C; Tend: 250. C |
Capillary | OV-101 | 1359. | Yang, Sugisawa, et al., 1992 | N2, 2. K/min; Column length: 50. m; Column diameter: 0.25 mm; Tstart: 80. C; Tend: 200. C |
Capillary | OV-101 | 1362. | Yang, Sugisawa, et al., 1992 | N2, 2. K/min; Column length: 50. m; Column diameter: 0.25 mm; Tstart: 80. C; Tend: 200. C |
Capillary | DB-5 | 1380. | Le Quere and Latrasse, 1990 | 60. m/0.32 mm/1. μm, He, 3. K/min; Tstart: 40. C; Tend: 220. C |
Capillary | DB-1 | 1360.3 | Chang, Sheng, et al., 1989 | 2. K/min; Column length: 30. m; Column diameter: 0.25 mm; Tstart: 50. C; Tend: 300. C |
Capillary | DB-1 | 1361.5 | Chang, Sheng, et al., 1989 | 2. K/min; Column length: 30. m; Column diameter: 0.25 mm; Tstart: 50. C; Tend: 300. C |
Capillary | DB-1 | 1360.0 | Chang, Sheng, et al., 1989 | 2. K/min; Column length: 30. m; Column diameter: 0.25 mm; Tstart: 50. C; Tend: 300. C |
Capillary | DB-1 | 1360.3 | Chang, Sheng, et al., 1989 | 2. K/min; Column length: 30. m; Column diameter: 0.25 mm; Tstart: 50. C; Tend: 300. C |
Capillary | OV-101 | 1359. | Pieribattesti, Smadja, et al., 1988 | H2, 2. K/min; Column length: 50. m; Column diameter: 0.32 mm; Tstart: 50. C; Tend: 200. C |
Capillary | CP Sil 5 CB | 1357. | Montanarella, Bos, et al., 1986 | N2, 4. K/min; Column length: 25. m; Column diameter: 0.22 mm; Tstart: 70. C; Tend: 295. C |
Capillary | OV-1 | 1361. | De Pooter, Omar, et al., 1985 | 30. m/0.5 mm/0.8 μm, He, 2. K/min; Tstart: 40. C; Tend: 220. C |
Capillary | OV-1 | 1361. | De Pooter, Omar, et al., 1985 | 30. m/0.5 mm/0.8 μm, He, 2. K/min; Tstart: 40. C; Tend: 220. C |

Van Den Dool and Kratz RI, non-polar column, custom temperature program

Column type | Active phase | I | Reference | Comment |
---|---|---|---|---|
Capillary | VF-5MS | 1383. | Tret'yakov, 2008 | 30. m/0.25 mm/0.25 μm, He; Program: Multi-step temperature program; T(initial)=60C; T(final)=270C |
Capillary | BPX-5 | 1385. | Dharmawan, Kasapis, et al., 2007 | 30. m/0.25 mm/0.25 μm, He; Program: 35C => 4C/min => 200C => 30C/min => 300C (3min) |
Capillary | BPX-5 | 1386. | Cardeal, da Silva, et al., 2006 | 30. m/0.25 mm/0.25 μm; Program: 35C(5min) => 3C/min => 210C => 40C/min => 240C (4min) |
Capillary | HP-5MS | 1380. | Bonaiti, Irlinger, et al., 2005 | 30. m/0.25 mm/0.25 μm, He; Program: 5C(8min) => 3C/min => 20C => 10C/min => 150C(10min) |
Capillary | 5 % Phenyl methyl siloxane | 1381. | Sacchetti, Maietti, et al., 2005 | 30. m/0.32 mm/0.15 μm, He; Program: 45C => 1C/min => 100C => 5C/min => 250C (10min) |
Capillary | SE-52 | 1386. | Frizzo, Lorenzo, et al., 2004 | 25. m/0.32 mm/0.43 μm, H2; Program: 60C(8min) => 3C/min => 180C => 20C/min => 250C(10min) |
Capillary | SE-52 | 1387. | Lorenzo, Paz, et al., 2004 | 25. m/0.32 mm/0.4 μm; Program: 60C(8min) => 3C/min => 180C => 20C/min => 250C(10min) |
Capillary | BP-1 | 1359. | Filippini, Tomi, et al., 2000 | Program: not specified |
Capillary | SE-52 | 1388. | Lorenzo, Dellacassa, et al., 2000 | 25. m/0.25 mm/0.25 μm, He; Program: 60C(8min) => 3C/min => 180C => 20C/min => 230C |
Capillary | BPX-5 | 1387. | Elmore, Erbahadir, et al., 1997 | 50. m/0.32 mm/0.5 μm, He; Program: 0C (5min) => 40C/min => 40C (2min) => 10C/min => 280C |
Capillary | SE-52 | 1382. | Mondello, Dugo, et al., 1995 | 60. m/0.32 mm/0.40 μm, He; Program: 45 C (6 min) 3 C/min -> 111 0C 2 C/min -> 160 C 3 C/min -> 300 C (15 min) |

Van Den Dool and Kratz RI, polar column, temperature ramp

Column type | Active phase | I | Reference | Comment |
---|---|---|---|---|
Capillary | BP-20 | 1753. | Duquesnoy, Castola, et al., 2007 | 50. m/0.22 mm/0.25 μm, He, 2. K/min, 220. C @ 20. min; Tstart: 60. C |
Capillary | RTX-Wax | 1752. | Paolini J., Costa J., et al., 2007 | 60. m/0.22 mm/0.25 μm, He, 2. K/min, 230. C @ 35. min; Tstart: 60. C |
Capillary | Polyethylene Glycol | 1751. | Dob, Dahmane, et al., 2006 | 30. m/0.32 mm/0.25 μm, N2, 50. C @ 10. min, 2. K/min, 230. C @ 15. min |
Capillary | BP-20 | 1746. | Gonny, Cavaleiro, et al., 2006 | 50. m/0.22 mm/0.25 μm, He, 2. K/min, 220. C @ 20. min; Tstart: 60. C |
Capillary | DB-Wax | 1759. | Pala-Paul, Copeland, et al., 2006 | 60. m/0.32 mm/0.25 μm, He, 3. K/min; Tstart: 35. C; Tend: 220. C |
Capillary | Supelcowax-10 | 1755. | Pinto, Pina-Vaz, et al., 2006 | 30. m/0.2 mm/0.2 μm, He, 3. K/min, 220. C @ 15. min; Tstart: 70. C |
Capillary | Supelcowax-10 | 1755. | Salgueiro L.R., Pinto E., et al., 2006 | 30. m/0.2 mm/0.2 μm, He, 3. K/min, 220. C @ 15. min; Tstart: 70. C |
Capillary | HP-20M | 1729. | Skocibusic, Bezic, et al., 2006 | 50. m/0.2 mm/0.2 μm, He, 70. C @ 4. min, 4. K/min, 180. C @ 10. min |
Capillary | OV-351 | 1743. | Bonvehí, 2005 | 50. m/0.32 mm/0.2 μm, He, 5. K/min; Tstart: 60. C; Tend: 220. C |
Capillary | DB-Wax | 1766. | Choi, 2005 | 60. m/0.25 mm/0.25 μm, N2, 70. C @ 2. min, 2. K/min, 230. C @ 20. min |
Capillary | RTX-Wax | 1739. | Cozzani, Muselli, et al., 2005 | 60. m/0.22 mm/0.25 μm, 2. K/min, 220. C @ 20. min; Tstart: 60. C |
Capillary | DB-Wax | 1746. | Fanciullino, Gancel, et al., 2005 | 30. m/0.25 mm/0.25 μm, He, 3. K/min, 250. C @ 20. min; Tstart: 40. C |
Capillary | BP-20 | 1755. | Ferrari, Tomi, et al., 2005 | 50. m/0.22 mm/0.25 μm, He, 2. K/min, 220. C @ 20. min; Tstart: 60. C |
Capillary | DB-Wax | 1744. | Gancel, Ollitrault, et al., 2005 | 30. m/0.25 mm/0.25 μm, He, 3. K/min, 250. C @ 20. min; Tstart: 40. C |
Capillary | RTX-Wax | 1752. | Paolini, Costa, et al., 2005 | 60. m/0.22 mm/0.25 μm, He, 2. K/min, 230. C @ 35. min; Tstart: 60. C |
Capillary | Supelcowax-10 | 1713. | Smadja, Rondeau, et al., 2005 | 60. m/0.2 mm/0.2 μm, He, 2. K/min, 200. C @ 10. min; Tstart: 60. C |
Capillary | Megawax | 1738. | Verzera, Trozzi, et al., 2005 | 30. m/0.25 mm/0.25 μm, He, 40. C @ 6. min, 2. K/min, 220. C @ 10. min |
Capillary | DB-Wax | 1759. | Brophy, Goldsack, et al., 2004 | 60. m/0.32 mm/0.25 μm, He, 3. K/min; Tstart: 32. C; Tend: 220. C |
Capillary | RTX-Wax | 1741. | Dugo, Mondello, et al., 2004 | 30. m/0.25 mm/0.25 μm, He, 45. C @ 6. min, 3. K/min, 240. C @ 10. min |
Capillary | DB-Wax | 1764. | Gocmen, Gurbuz, et al., 2004 | 0. m/0.32 mm/0.5 μm, 7. K/min, 240. C @ 5. min; Tstart: 40. C |
Capillary | BP-20 | 1762. | Tam, Thuam, et al., 2004 | 50. m/0.22 mm/0.25 μm, He, 2. K/min, 220. C @ 20. min; Tstart: 60. C |
Capillary | DB-Wax | 1740. | Yu, Kim, et al., 2004 | 30. m/0.25 mm/0.25 μm, He, 40. C @ 5. min, 4. K/min, 200. C @ 20. min |
Capillary | DB-Wax | 1743. | Yu, Kim, et al., 2004 | 30. m/0.25 mm/0.25 μm, He, 40. C @ 5. min, 4. K/min, 200. C @ 20. min |
Capillary | DB-Wax | 1747. | Yu, Kim, et al., 2004, 2 | 30. m/0.25 mm/0.25 μm, He, 40. C @ 5. min, 4. K/min, 200. C @ 20. min |
Capillary | HP-20M | 1717. | Bezic, Skocibusic, et al., 2003 | 50. m/0.2 mm/0.2 μm, He, 70. C @ 4. min, 4. K/min, 180. C @ 10. min |
Capillary | OV-351 | 1743. | Bonvehi and Coll, 2003 | 50. m/0.32 mm/0.2 μm, He, 5. K/min; Tstart: 60. C; Tend: 220. C |
Capillary | Supelcowax | 1771. | Chisholm, Wilson, et al., 2003 | 25. m/0.25 mm/0.25 μm, 35. C @ 5. min, 4. K/min, 225. C @ 10. min |
Capillary | DB-Wax | 1744. | Gancel, Ollitrault, et al., 2003 | 60. m/0.32 mm/0.25 μm, H2, 1.5 K/min, 245. C @ 20. min; Tstart: 40. C |
Capillary | HP-20M | 1717. | Jerkovic, Mastelic, et al., 2003 | 50. m/0.2 mm/0.2 μm, He, 70. C @ 4. min, 4. K/min, 180. C @ 10. min |
Capillary | HP-20M | 1729. | Radonic and Milso, 2003 | 50. m/0.2 mm/0.2 μm, He, 70. C @ 4. min, 5. K/min, 180. C @ 10. min |
Capillary | HP20Wax | 1729. | Skocibusic and Bezic, 2003 | 50. m/0.2 mm/0.2 μm, He, 70. C @ 4. min, 4. K/min, 180. C @ 10. min |
Capillary | Megawax | 1738. | Verzera, Trozzi, et al., 2003 | 30. m/0.25 mm/0.25 μm, He, 40. C @ 6. min, 2. K/min, 220. C @ 10. min |
Capillary | DB-Wax | 1757. | Choi, Kim. M.-S.L., et al., 2002 | 60. m/0.25 mm/0.25 μm, N2, 2. K/min, 230. C @ 20. min; Tstart: 70. C |
Capillary | DB-Wax | 1707. | Claudela, Dirningera, et al., 2002 | 60. m/0.32 mm/0.5 μm, He, 2.7 K/min, 235. C @ 30. min; Tstart: 67. C |
Capillary | BP-20 | 1748. | Lota, de Rocca Serra, et al., 2002 | 50. m/0.22 mm/0.25 μm, He, 2. K/min, 220. C @ 20. min; Tstart: 60. C |
Capillary | RTX-Wax | 1740. | Mondello, Zappia, et al., 2002 | 30. m/0.25 mm/0.25 μm, He, 45. C @ 6. min, 3. K/min, 250. C @ 10. min |
Capillary | BP-20 | 1748. | Pintore, Usai, et al., 2002 | 50. m/0.22 mm/0.25 μm, 2. K/min, 220. C @ 20. min; Tstart: 60. C |
Capillary | RTX-Wax | 1740. | Shellie, Mondello, et al., 2002 | 30. m/0.25 mm/0.25 μm, He, 45. C @ 6. min, 3. K/min; Tend: 250. C |
Capillary | RTX-Wax | 1750. | Shellie, Mondello, et al., 2002 | 30. m/0.25 mm/0.25 μm, He, 45. C @ 6. min, 3. K/min; Tend: 250. C |
Capillary | BP-20 | 1748. | Lota, Serra, et al., 2001 | 50. m/0.22 mm/0.25 μm, He, 2. K/min; Tstart: 60. C; Tend: 220. C |
Capillary | HP-20M | 1729. | Milos, Radonic, et al., 2001 | 50. m/0.20 mm/0.20 μm, He, 70. C @ 4. min, 4. K/min, 180. C @ 10. min |
Capillary | BP-20 | 1746. | Rezzi, Bighelli, et al., 2001 | 50. m/0.22 mm/0.25 μm, He, 2. K/min, 220. C @ 20. min; Tstart: 60. C |
Capillary | DB-Wax | 1772. | Bartley and Jacobs, 2000 | 60. m/0.5 mm/0.32 μm, He, 40. C @ 2. min, 4. K/min, 290. C @ 5. min |
Capillary | DB-Wax | 1740. | Brophy, Goldsack, et al., 2000 | 60. m/0.53 mm/1.0 μm, He, 3. K/min; Tstart: 50. C; Tend: 220. C |
Capillary | DB-Wax | 1766. | Choi and Sawamura, 2000 | 60. m/0.25 mm/0.25 μm, N2, 70. C @ 2. min, 2. K/min, 230. C @ 20. min |
Capillary | BP-20 | 1748. | Lota, de Rocca Serra, et al., 2000 | 50. m/0.22 mm/0.25 μm, He, 2. K/min, 230. C @ 35. min; Tstart: 60. C |
Capillary | BP-20 | 1748. | Lota, de Rocca Serra, et al., 2000 | 50. m/0.22 mm/0.25 μm, He, 2. K/min, 230. C @ 35. min; Tstart: 60. C |
Capillary | Megawax | 1738. | Verzera, Trozzi, et al., 2000 | 30. m/0.25 mm/0.25 μm, He, 40. C @ 6. min, 2. K/min, 220. C @ 10. min |
Capillary | BP-20 | 1748. | Lota, Serra, et al., 1999 | 50. m/0.22 mm/0.25 μm, He, 2. K/min, 230. C @ 35. min; Tstart: 60. C |
Capillary | BP-20 | 1748. | Lota, Serra, et al., 1999 | 50. m/0.22 mm/0.25 μm, He, 2. K/min, 230. C @ 35. min; Tstart: 60. C |
Capillary | BP-20 | 1752. | Mazzoni, Tomi, et al., 1999 | 50. m/0.22 mm/0.25 μm, He, 2. K/min, 220. C @ 20. min; Tstart: 60. C |
Capillary | DB-Wax | 1753. | Cha, Kim, et al., 1998 | 60. m/0.25 mm/0.25 μm, 40. C @ 5. min, 3. K/min, 200. C @ 60. min |
Capillary | BP-20 | 1747. | Mariotti, Costa, et al., 1997 | 50. m/0.22 mm/0.25 μm, He, 2. K/min, 230. C @ 35. min; Tstart: 60. C |
Capillary | BP-20 | 1747. | Mariotti, Tomi, et al., 1997 | 50. m/0.22 mm/0.25 μm, He, 2. K/min, 230. C @ 35. min; Tstart: 60. C |
Capillary | CP-Wax 52CB | 1758. | Chyau, Mau, et al., 1996 | 50. m/0.23 mm/0.12 μm, H2, 50. C @ 10. min, 1.5 K/min, 200. C @ 10. min |
Capillary | DB-Wax | 1763. | Stashenko, Prada, et al., 1996 | 60. m/0.25 mm/0.25 μm, He, 50. C @ 5. min, 2.5 K/min; Tend: 180. C |
Capillary | Carbowax 20M | 1747. | Mondello, Dugo, et al., 1995 | 60. m/0.32 mm/0.425 μm, He, 45. C @ 3. min, 3. K/min, 300. C @ 20. min |
Capillary | Carbowax 20M | 1733. | Píry, Príbela, et al., 1995 | 50. m/0.2 mm/0.2 μm, He, 30. C @ 2. min, 4. K/min, 170. C @ 20. min |
Capillary | CP-Wax 52CB | 1766. | Wu and Yang, 1994 | H2, 50. C @ 10. min, 1.5 K/min, 200. C @ 40. min; Column length: 50. m; Column diameter: 0.32 mm |
Capillary | DB-Wax | 1756. | Le Quere and Latrasse, 1990 | 30. m/0.32 mm/0.5 μm, He, 3. K/min; Tstart: 40. C; Tend: 220. C |
Capillary | DB-Wax | 1766.6 | Chang, Sheng, et al., 1989 | 2. K/min; Column length: 30. m; Column diameter: 0.25 mm; Tstart: 50. C; Tend: 240. C |
Capillary | DB-Wax | 1768.4 | Chang, Sheng, et al., 1989 | 2. K/min; Column length: 30. m; Column diameter: 0.25 mm; Tstart: 50. C; Tend: 240. C |
Capillary | DB-Wax | 1767.1 | Chang, Sheng, et al., 1989 | 2. K/min; Column length: 30. m; Column diameter: 0.25 mm; Tstart: 50. C; Tend: 240. C |
Capillary | DB-Wax | 1768.4 | Chang, Sheng, et al., 1989 | 2. K/min; Column length: 30. m; Column diameter: 0.25 mm; Tstart: 50. C; Tend: 240. C |
Capillary | DB-Wax | 1748. | Fröhlich, Duque, et al., 1989 | 30. m/0.25 mm/0.25 μm, He, 50. C @ 3. min, 4. K/min; Tend: 250. C |
Capillary | DB-Wax | 1749. | Fröhlich, Duque, et al., 1989 | 30. m/0.25 mm/0.25 μm, He, 50. C @ 3. min, 4. K/min; Tend: 250. C |
Capillary | Carbowax 20M | 1742. | Chen and Ho, 1988 | He, 1.5 K/min, 225. C @ 80. min; Column length: 60. m; Column diameter: 0.32 mm; Tstart: 50. C |
Capillary | Carbowax 20M | 1748. | Peppard and Ramus, 1988 | 60. m/0.32 mm/0.25 μm; Tstart: 40. C; Tend: 230. C |
Capillary | Carbowax 20M | 1750. | Peppard and Ramus, 1988 | 60. m/0.32 mm/0.25 μm; Tstart: 40. C; Tend: 230. C |
Capillary | Carbowax 20M | 1752. | Peppard and Ramus, 1988 | 60. m/0.32 mm/0.25 μm; Tstart: 40. C; Tend: 230. C |
Capillary | Carbowax 20M | 1754. | Peppard and Ramus, 1988 | 60. m/0.32 mm/0.25 μm; Tstart: 40. C; Tend: 230. C |
Capillary | Carbowax 20M | 1755. | Peppard and Ramus, 1988 | 60. m/0.32 mm/0.25 μm; Tstart: 40. C; Tend: 230. C |

Van Den Dool and Kratz RI, polar column, custom temperature program

Column type | Active phase | I | Reference | Comment |
---|---|---|---|---|
Capillary | RTX-Wax | 1737. | Dugo, Mondello, et al., 2004 | Program: not specified |
Capillary | BP-20 | 1747. | Filippini, Tomi, et al., 2000 | Program: not specified |

Normal alkane RI, non-polar column, temperature ramp

Column type | Active phase | I | Reference | Comment |
---|---|---|---|---|
Capillary | HP-5 | 1383. | Bertuzzi, Tirillini, et al., 2013 | 30. m/0.25 mm/0.25 μm, Helium, 60. C @ 3. min, 4. K/min, 300. C @ 15. min |
Capillary | RTX-5 MS | 1383. | Pinheiro, de Queiros, et al., 2013 | Helium, 3. K/min; Column length: 30. m; Column diameter: 0.25 mm; Tstart: 60. C; Tend: 240. C |
Capillary | HP-5 MS | 1396. | Sardashti, Valizadeh, et al., 2013 | 60. m/0.25 mm/0.25 μm, Helium, 40. C @ 1. min, 3. K/min, 250. C @ 20. min |
Capillary | RTX-1 | 1362. | Bendiabdellah, El Amine Dib, et al., 2012 | 60. m/0.22 mm/0.25 μm, Helium, 2. K/min, 230. C @ 5. min; Tstart: 60. C |
Capillary | RTX-1 | 1362. | Bendiabdellah, El Amine Dib, et al., 2012 | 60. m/0.22 mm/0.25 μm, Helium, 2. K/min, 230. C @ 5. min; Tstart: 60. C |
Capillary | DP-5 | 1352. | Vijayakumar, Duraipandiyan, et al., 2012 | 30. m/0.25 mm/0.25 μm, Helium, 80. C @ 1. min, 4. K/min, 300. C @ 40. min |
Capillary | DP-5 | 1352. | Vijayakumar, Duraipandiyan, et al., 2012 | 30. m/0.25 mm/0.25 μm, Helium, 80. C @ 1. min, 4. K/min, 300. C @ 40. min |
Capillary | HP-1 | 1381. | Alizadeh, Khosh-Khui, et al., 2011 | 30. m/0.25 mm/0.25 μm, Helium, 3. K/min; Tstart: 60. C; Tend: 240. C |
Capillary | SE-30 MS | 1388. | Menichini, Tundis, et al., 2011 | 30. m/0.25 mm/0.25 μm, Helium, 50. C @ 5. min, 5. K/min, 250. C @ 10. min |
Capillary | DB-1 | 1364. | Misharina T., 2011 | 50. m/0.32 mm/0.25 μm, Helium, 8. K/min; Tstart: 60. C; Tend: 250. C |
Capillary | DB-5 MS | 1377. | Chalchat, Figueredo, et al., 2010 | 25. m/0.30 mm/0.25 μm, Helium, 3. K/min; Tstart: 50. C; Tend: 240. C |
Capillary | RTX-1 | 1362. | Dib, Djabou, et al., 2010 | 60. m/0.22 mm/0.25 μm, Helium, 2. K/min, 230. C @ 30. min; Tstart: 60. C |
Capillary | DB-5 MS | 1373. | Mesa-Arango, Betancur-Galvis, et al., 2010 | 60. m/0.25 mm/0.25 μm, Helium, 40. C @ 15. min, 5. K/min, 250. C @ 15. min |
Capillary | DB-1 | 1358. | Mirjalili, Salehi, et al., 2010 | 25. m/0.25 mm/0.25 μm, Nitrogen, 60. C @ 1. min, 4. K/min, 250. C @ 10. min |
Capillary | BP-1 | 1357. | Mishra, Chaudhary, et al., 2010 | Nitrogen, 60. C @ 10. min, 5. K/min, 220. C @ 30. min |
Capillary | HP-5 | 1385. | Miyazawa, Kawauchi, et al., 2010 | 30. m/0.25 mm/0.25 μm, Helium, 4. K/min, 260. C @ 5. min; Tstart: 40. C |
Capillary | HP-5 | 1391. | Miyazawa, Kawauchi, et al., 2010 | 30. m/0.25 mm/0.25 μm, Helium, 4. K/min, 260. C @ 5. min; Tstart: 40. C |
Capillary | HP-5 | 1388. | Monsef-Esfahani, Miri, et al., 2010 | 30. m/0.25 mm/0.25 μm, Helium, 50. C @ 5. min, 3. K/min; Tend: 240. C |
Capillary | HP-5 | 1390. | Radulovic, Dordevic, et al., 2010 | 30. m/0.25 mm/0.25 μm, Hydrogen, 5. K/min; Tstart: 70. C; Tend: 290. C |
Capillary | HP-5 MS | 1378. | Radulovic, Dordevic, et al., 2010, 2 | 30. m/0.25 mm/0.25 μm, Helium, 5. K/min, 290. C @ 10. min; Tstart: 70. C |
Capillary | DB-1 | 1357. | Safaei-Ghomi, Meshkatalsadat, et al., 2010 | 60. m/0.25 mm/0.25 μm, Nitrogen, 60. C @ 1. min, 4. K/min, 250. C @ 10. min |
Capillary | DB-1-MS | 1360. | Takeoka, Hobbs, et al., 2010 | 60. m/0.25 mm/0.25 μm, Helium, 30. C @ 4. min, 2. K/min, 200. C @ 35. min |
Capillary | DB-5 | 1379. | Vahirua-Lechat, Mitermite, et al., 2010 | 30. m/0.25 mm/0.25 μm, Helium, 3. K/min, 240. C @ 2. min; Tstart: 80. C |
Capillary | SPB-5 | 1411. | Gilani, Shah, et al., 2009 | 30. m/0.53 mm/0.50 μm, Nitrogen, 50. C @ 5. min, 3. K/min, 210. C @ 45. min |
Capillary | DB-5 MS | 1381. | Koba, Sanda, et al., 2009 | 30. m/0.25 mm/0.25 μm, Helium, 50. C @ 5. min, 2. K/min; Tend: 250. C |
Capillary | HP-5 | 1379. | Maridass, 2009 | 25. m/0.20 mm/0.33 μm, Helium, 3. K/min, 240. C @ 7. min; Tstart: 60. C |
Capillary | BP-1 | 1363. | Ottavioli, Bighelli, et al., 2009 | 50. m/0.22 mm/0.25 μm, Helium, 2. K/min, 220. C @ 20. min; Tstart: 60. C |
Capillary | DB-5 | 1383. | Porto, Decorti, et al., 2009 | 30. m/0.25 mm/0.25 μm, Helium, 45. C @ 3. min, 3. K/min, 250. C @ 5. min |
Capillary | DB-5 | 1381. | Scrivanti, Anton, et al., 2009 | 30. m/0.25 mm/0.25 μm, Nitrogen, 2. K/min; Tstart: 40. C; Tend: 230. C |
Capillary | DB-1 MS | 1360. | Seo, Kim, et al., 2009 | 30. m/0.25 mm/0.25 μm, Helium, 40. C @ 1. min, 6. K/min, 250. C @ 4. min |
Capillary | HP-5MS | 1383. | Wannes, Mhamdi, et al., 2009 | 30. m/0.25 mm/0.25 μm, Helium, 5. K/min; Tstart: 50. C; Tend: 240. C |
Capillary | HP-5 | 1385. | Aicha, Ines, et al., 2008 | 30. m/0.25 mm/0.25 μm, Helium, 50. C @ 3. min, 9. K/min, 280. C @ 3. min |
Capillary | ZB-1 | 1347. | Mierendorff, Stahl-Biskup, et al., 2008 | 30. m/0.25 mm/0.25 μm, Nitrogen, 3. K/min; Tstart: 45. C; Tend: 230. C |
Capillary | HP-5 MS | 1377. | Sahraoui, Vian, et al., 2008 | 30. m/0.25 mm/0.25 μm, Helium, 60. C @ 8. min, 2. K/min, 250. C @ 15. min |
Capillary | OV-1 | 1409. | Wang, Yi, et al., 2008 | 30. m/0.25 mm/0.25 μm, Helium, 6. K/min; Tstart: 65. C; Tend: 260. C |
Capillary | HP-5MS | 1379. | Argyropoulou, Daferera, et al., 2007 | 30. m/0.25 mm/0.25 μm, He, 3. K/min; Tstart: 60. C; Tend: 240. C |
Capillary | CP Sil 5 CB | 1369. | Baran, von Reuss, et al., 2007 | 30. m/0.32 mm/0.25 μm, N2, 4. K/min; Tstart: 60. C; Tend: 300. C |
Capillary | HP-5MS | 1394. | Ferhat, Meklati, et al., 2007 | 30. m/0.25 mm/0.25 μm, He, 60. C @ 8. min, 2. K/min, 250. C @ 15. min |
Capillary | HP-5MS | 1382. | Ferhat, Tigrine-Kordjani, et al., 2007 | 30. m/0.25 mm/0.25 μm, He, 60. C @ 8. min, 2. K/min, 250. C @ 15. min |
Capillary | 5 % Phenyl methyl siloxane | 1384. | Gil A., Van Baren C.M., et al., 2007 | 60. m/0.25 mm/0.25 μm, He, 3. K/min, 225. C @ 15. min; Tstart: 90. C |
Capillary | DBP-5 | 1342. | Heravi and Sereshti, 2007 | 25. m/0.25 mm/0.22 μm, Helium, 40. C @ 1. min, 3. K/min, 250. C @ 10. min |
Capillary | BP-1 | 1370. | Kiran, Devi, et al., 2007 | He, 5. K/min, 220. C @ 6. min; Tstart: 60. C |
Capillary | DB-1 | 1362. | Monser-Esfahani, Karamkhani, et al., 2007 | 30. m/0.25 mm/0.25 μm, Helium, 50. C @ 1. min, 2.5 K/min, 260. C @ 20. min |
Capillary | HP-5 | 1386. | Oliveira, Leitão, et al., 2007 | 25. m/0.2 mm/0.33 μm, H2, 3. K/min; Tstart: 60. C; Tend: 240. C |
Capillary | DB-1 | 1350. | Salehi, Fakhari, et al., 2007 | 60. m/0.25 mm/0.25 μm, He, 5. K/min; Tstart: 60. C; Tend: 250. C |
Capillary | DBP-5 | 1342. | Sereshti and Samadi, 2007 | 25. m/0.25 mm/0.22 μm, Helium, 40. C @ 1. min, 3. K/min, 250. C @ 10. min |
Capillary | DB-5 | 1385. | Sylvestre, Pichette, et al., 2007 | 30. m/0.25 mm/0.25 μm, 2. K/min, 250. C @ 33. min; Tstart: 40. C |
Capillary | HP-5 | 1381. | Bertrand, Comte, et al., 2006 | 60. m/0.25 mm/0.25 μm, He, 3. K/min; Tstart: 60. C; Tend: 250. C |
Capillary | HP-5MS | 1380. | Bozin, Mimicá-Dukic, et al., 2006 | 30. m/0.25 mm/0.25 μm, He, 3. K/min; Tstart: 60. C; Tend: 280. C |
Capillary | HP-1 | 1354. | Castel, Fernandez, et al., 2006 | 50. m/0.2 mm/0.5 μm, He, 2. K/min, 250. C @ 120. min; Tstart: 60. C |
Capillary | HP-1 | 1354. | Castel, Fernandez, et al., 2006 | 50. m/0.2 mm/0.33 μm, He, 60. C @ 4. min, 2. K/min, 250. C @ 30. min |
Capillary | BP-1 | 1358. | Fanciullino, Tomi, et al., 2006 | 50. m/0.22 mm/0.25 μm, He, 2. K/min, 220. C @ 20. min; Tstart: 60. C |
Capillary | BP-1 | 1358. | Fanciullino, Tomi, et al., 2006 | 50. m/0.22 mm/0.25 μm, He, 2. K/min, 220. C @ 20. min; Tstart: 60. C |
Capillary | HP-5MS | 1383. | Farah, Afifi, et al., 2006 | 30. m/0.25 mm/0.25 μm, He, 2. K/min; Tstart: 50. C; Tend: 250. C |
Capillary | HP-5 | 1378. | Figuérédo, Cabassu, et al., 2006 | 30. m/0.25 mm/0.25 μm, He, 50. C @ 5. min, 5. K/min, 300. C @ 5. min |
Capillary | DB-1 | 1362. | Hadian, Sonboli, et al., 2006 | 60. m/0.25 mm/0.25 μm, 5. K/min, 250. C @ 10. min; Tstart: 60. C |
Capillary | CP Sil 5 CB | 1362. | Hymete, Rohloff, et al., 2006 | 30. m/0.25 mm/0.25 μm, 3. K/min, 220. C @ 3. min; Tstart: 40. C |
Capillary | FSOT-RSL-200 | 1381. | Jirovetz, Eller, et al., 2006 | 30. m/0.32 mm/0.25 μm, Hydrogen, 40. C @ 5. min, 6. K/min, 280. C @ 5. min |
Capillary | BP-1 | 1370. | Kiran, Bhavani, et al., 2006 | Helium, 5. K/min, 220. C @ 6. min; Tstart: 60. C |
Capillary | RTX-1 | 1365. | Kula, Izydorczyk, et al., 2006 | 30. m/0.32 mm/0.25 μm, He, 4. K/min; Tstart: 60. C; Tend: 300. C |
Capillary | DB-1 | 1358. | Lan Phi N.T., Nishiyama C., et al., 2006 | 60. m/0.25 mm/0.25 μm, 70. C @ 2. min, 2. K/min, 230. C @ 20. min |
Capillary | DB-1 | 1359. | Lan Phi N.T., Nishiyama C., et al., 2006 | 60. m/0.25 mm/0.25 μm, 70. C @ 2. min, 2. K/min, 230. C @ 20. min |
Capillary | CP Sil 5 CB | 1365. | Lis and Milczarek, 2006 | 30. m/0.32 mm/0.25 μm, N2, 4. K/min; Tstart: 50. C; Tend: 300. C |
Capillary | DB-5 | 1385. | Mirza, Navaei, et al., 2006 | 30. m/0.25 mm/0.25 μm, Helium, 50. C @ 5. min, 3. K/min; Tend: 250. C |
Capillary | HP-5 | 1385. | Miyazawa and Kawata, 2006 | 30. m/0.32 mm/0.25 μm, Helium, 4. K/min, 240. C @ 5. min; Tstart: 40. C |
Capillary | NB-30 | 1371. | Orav, Raal, et al., 2006 | 30. m/0.2 mm/0.25 μm, He, 2. K/min; Tstart: 50. C; Tend: 250. C |
Capillary | DB-5 | 1387. | Ouamba, Ouabonzi, et al., 2006 | 25. m/0.25 mm/0.15 μm, N2, 50. C @ 3. min, 4. K/min; Tend: 200. C |
Capillary | DB-5 | 1382. | Ozel, Gogus, et al., 2006 | 30. m/0.32 mm/0.25 μm, He, 60. C @ 0.5 min, 5. K/min, 280. C @ 2. min |
Capillary | HP-5 | 1386. | Pintore G., Chessa M., et al., 2006 | 30. m/0.25 mm/0.25 μm, He, 60. C @ 10. min, 5. K/min; Tend: 220. C |
Capillary | DB-1 | 1361. | Sawamura, Onishi, et al., 2006 | 60. m/0.25 mm/0.25 μm, 70. C @ 2. min, 2. K/min, 230. C @ 20. min |
Capillary | DB-5 | 1383. | Silva, Oliveira, et al., 2006 | 30. m/0.20 mm/0.18 μm, H2, 3. K/min; Tstart: 60. C; Tend: 240. C |
Capillary | DB-1 | 1355. | Sonboli, Mirjalili, et al., 2006 | 60. m/0.25 mm/0.25 μm, Helium, 5. K/min, 250. C @ 10. min; Tstart: 60. C |
Capillary | SPB-5 | 1379. | Stojanovic, Palic, et al., 2006 | He, 50. C @ 3. min, 5. K/min, 250. C @ 15. min |
Capillary | BPX-5 | 1388. | Wohlmuth, Smith, et al., 2006 | 50. m/0.22 mm/1. μm, 4. K/min, 280. C @ 4. min; Tstart: 70. C |
Capillary | SPB-1 | 1363. | Wong, Lim, et al., 2006 | 50. m/0.2 mm/0.33 μm, He, 50. C @ 1. min, 4. K/min, 220. C @ 10. min |
Capillary | DB-5 | 1369. | Yadegarinia, Gachkar, et al., 2006 | 30. m/0.25 mm/0.25 μm, He, 4. K/min; Tstart: 40. C; Tend: 250. C |
Capillary | HP-5 | 1382. | Duarte, Figueira, et al., 2005 | 25. m/0.2 mm/0.33 μm, He, 3. K/min, 240. C @ 7. min; Tstart: 60. C |
Capillary | DB-1 | 1362. | Fakhari, Salehi, et al., 2005 | 60. m/0.25 mm/0.25 μm, He, 5. K/min; Tstart: 60. C; Tend: 250. C |
Capillary | HP-5 | 1378. | Figuérédo, Cabassu, et al., 2005 | 30. m/0.25 mm/0.25 μm, He, 50. C @ 5. min, 5. K/min, 300. C @ 5. min |
Capillary | HP-5MS | 1387. | Ghasemi Y., Faridi P., et al., 2005 | He, 50. C @ 3. min, 3. K/min, 250. C @ 10. min; Column length: 25. m; Column diameter: 0.25 mm |
Capillary | SPB-1 | 1363. | Hamilton, Hall, et al., 2005 | 30. m/0.25 mm/0.2 μm, 60. C @ 2. min, 6. K/min; Tend: 250. C |
Capillary | HP-5MS | 1381. | Petrakis, Roussis, et al., 2005 | 3. K/min; Column length: 30. m; Column diameter: 0.2 mm; Tstart: 60. C; Tend: 280. C |
Capillary | Methyl Silicone | 1363. | Ricci, Fraternale, et al., 2005 | 12.5 m/0.25 mm/0.25 μm, He, 4. K/min; Tstart: 50. C; Tend: 270. C |
Capillary | HP-5MS | 1387. | Setzer, Noletto, et al., 2005 | 30. m/0.25 mm/0.25 μm, He, 60. C @ 5. min, 3. K/min; Tend: 280. C |
Capillary | HP-5MS | 1381. | Vichi, Riu-Aumatell, et al., 2005 | 30. m/0.25 mm/0.25 μm, 40. C @ 5. min, 3. K/min, 220. C @ 10. min |
Capillary | SPB-1 | 1362. | Wong, Lee, et al., 2005 | 50. m/0.2 mm/0.33 μm, He, 50. C @ 3. min, 4. K/min, 220. C @ 30. min |
Capillary | SPB-1 | 1360. | Wong and Tan, 2005 | 50. m/0.2 mm/0.33 μm, He, 50. C @ 3. min, 4. K/min, 220. C @ 30. min |
Capillary | DB-1 | 1340. | Choi, 2004 | 60. m/0.25 mm/0.25 μm, N2, 70. C @ 2. min, 2. K/min, 230. C @ 20. min |
Capillary | DB-5 | 1383. | Kalvandi, Sefidkon, et al., 2004 | 60. m/0.25 mm/0.25 μm, He, 40. C @ 4. min, 4. K/min; Tend: 280. C |
Capillary | RTX-1 | 1361. | Lis, Boczek, et al., 2004 | 30. m/0.32 mm/0.25 μm, N2, 4. K/min; Tstart: 60. C; Tend: 300. C |
Capillary | DB-5 | 1385. | Lopez Arze, Collin, et al., 2004 | 30. m/0.25 mm/0.25 μm, 40. C @ 2. min, 2. K/min, 210. C @ 33. min |
Capillary | DB-5MS | 1354. | Marongiu, Piras, et al., 2004 | 30. m/0.25 mm/0.25 μm, He, 3. K/min, 280. C @ 30. min; Tstart: 60. C |
Capillary | HP-5MS | 1380. | Mimica-Dukic, Bozin, et al., 2004 | 30. m/0.25 mm/0.25 μm, He, 3. K/min; Tstart: 60. C; Tend: 280. C |
Capillary | NB-30 | 1364. | Raal, Arak, et al., 2004 | 50. m/0.2 mm/0.25 μm, He, 2. K/min; Tstart: 50. C; Tend: 250. C |
Capillary | NB-30 | 1362. | Raal, Paaver, et al., 2004 | 50. m/0.20 mm/0.25 μm, He, 2. K/min; Tstart: 50. C; Tend: 250. C |
Capillary | HP-5MS | 1379. | Sadeghpour, Asghari, et al., 2004 | 30. m/0.25 mm/0.25 μm, He, 4. K/min; Tstart: 60. C; Tend: 280. C |
Capillary | DB-1 | 1340. | Sawamura, Son, et al., 2004 | 60. m/0.25 mm/0.25 μm, 70. C @ 2. min, 2. K/min, 230. C @ 20. min |
Capillary | DB-1 | 1340. | Sawamura, Sou, et al., 2004 | 60. m/0.25 mm/0.25 μm, Nitrogen, 70. C @ 2. min, 2. K/min; Tend: 230. C |
Capillary | HP-5MS | 1382. | Afsharypuor and Jahromy, 2003 | 30. m/0.25 mm/0.25 μm, He, 4. K/min; Tstart: 60. C; Tend: 275. C |
Capillary | DB-1 | 1340. | Choi, 2003 | 60. m/0.25 mm/0.25 μm, He, 70. C @ 2. min, 2. K/min, 230. C @ 20. min |
Capillary | Methyl Silicone | 1363. | Curini, Bianchi, et al., 2003 | He, 4. K/min; Column length: 12.5 m; Column diameter: 0.25 mm; Tstart: 50. C; Tend: 270. C |
Capillary | RTX-5Sil | 1383. | Dudai, Larkov, et al., 2003 | 30. m/0.25 mm/0.25 μm, He, 4. K/min, 200. C @ 10. min; Tstart: 70. C |
Capillary | DB-1 | 1345. | Fekam Boyom, Ngouana, et al., 2003 | 30. m/0.25 mm/0.25 μm, N2, 5. K/min; Tstart: 50. C; Tend: 200. C |
Capillary | RSL-200 | 1378. | Jirovetz, Buchbauer, et al., 2003 | 30. m/0.25 mm/0.25 μm, H2, 40. C @ 2. min, 6. K/min, 280. C @ 10. min |
Capillary | DB-5 | 1388. | Juteau, Jerkovic, et al., 2003 | 50. m/0.2 mm/0.25 μm, He, 50. C @ 2. min, 3. K/min, 220. C @ 10. min |
Capillary | DB-5MS | 1382. | Maia, Taveira, et al., 2003 | 30. m/0.25 mm/0.25 μm, He, 3. K/min; Tstart: 60. C; Tend: 240. C |
Capillary | ZB-1 | 1362. | Mierendorff, Stahl-Biskup, et al., 2003 | 30. m/0.25 mm/0.25 μm, N2, 3. K/min; Tstart: 45. C; Tend: 230. C |
Capillary | MPS-5 | 1380. | Nakahara, Alzoreky, et al., 2003 | 70. C @ 2. min, 5. K/min; Tend: 180. C |
Capillary | HP-5 | 1365. | Pitarokili, Tzakou, et al., 2003 | 30. m/0.25 mm/0.25 μm, He, 3. K/min; Tstart: 60. C; Tend: 280. C |
Capillary | DB-1 | 1364. | Rasooli and Mirmostafa, 2003 | 60. m/0.25 mm/0.25 μm, He, 4. K/min; Tstart: 40. C; Tend: 220. C |
Capillary | DB-5 | 1384. | da Silva, Luz, et al., 2003 | 30. m/0.25 mm/0.25 μm, He, 3. K/min; Tstart: 60. C; Tend: 240. C |
Capillary | DB-1 | 1344. | Tu, Onishi, et al., 2003 | 60. m/0.25 mm/0.25 μm, N2, 70. C @ 2. min, 2. K/min, 230. C @ 20. min |
Capillary | DB-1 | 1369. | Tu, Onishi, et al., 2003, 2 | 60. m/0.25 mm/0.25 μm, N2, 70. C @ 2. min, 2. K/min, 230. C @ 20. min |
Capillary | DB-5 | 1376. | Caredda, Marongiu, et al., 2002 | 30. m/0.25 mm/0.25 μm, He, 3. K/min, 280. C @ 30. min; Tstart: 60. C |
Capillary | BP-1 | 1359. | Das, Ram, et al., 2002 | 25. m/0.50 mm/0.25 μm, N2, 5. K/min, 220. C @ 10. min; Tstart: 60. C |
Capillary | DB-1 | 1357. | Gancel, Ollé, et al., 2002 | 30. m/0.32 mm/0.25 μm, H2, 40. C @ 20. min, 3. K/min; Tend: 245. C |
Capillary | HP-5 | 1380. | Ghannadi, Sajjadi, et al., 2002 | 30. m/0.25 mm/0.25 μm, He, 4. K/min; Tstart: 60. C; Tend: 275. C |
Capillary | CP Sil 8 CB | 1386. | Juteau, Masotti, et al., 2002 | 30. m/0.25 mm/0.25 μm, He, 50. C @ 2. min, 3. K/min; Tend: 220. C |
Capillary | SPB-5 | 1349. | Kim and Lee, 2002 | 60. m/0.25 mm/0.25 μm, He, 50. C @ 3. min, 5. K/min, 240. C @ 10. min |
Capillary | DB-5 | 1398. | Lin, Rouseff, et al., 2002 | 30. m/0.32 mm/0.25 μm, He, 7. K/min; Tstart: 40. C; Tend: 290. C |
Capillary | DB-1 | 1387. | Norouzi-Arasi, Yavari, et al., 2002 | 30. m/0.25 mm/0.25 μm, He, 60. C @ 10. min, 4. K/min; Tend: 250. C |
Capillary | OV-101 | 1365. | Orav, Kailas, et al., 2002 | 50. m/0.2 mm/0.5 μm, He, 2. K/min; Tstart: 50. C; Tend: 250. C |
Capillary | DB-1 | 1356. | Sefidkon, Jalili, et al., 2002 | 60. m/0.25 mm/0.25 μm, He, 40. C @ 5. min, 4. K/min; Tend: 280. C |
Capillary | DB-5MS | 1384. | Zoghbi, Andrade, et al., 2002 | 30. m/0.25 mm/0.25 μm, He, 3. K/min; Tstart: 60. C; Tend: 270. C |
Capillary | BP-1 | 1365. | Gupta, Mallavarapu, et al., 2001 | 30. m/0.25 mm/0.25 μm, N2, 5. K/min; Tstart: 60. C; Tend: 220. C |
Capillary | SPB-1 | 1364. | Kamath, Asha, et al., 2001 | 30. m/0.25 mm/0.25 μm, N2, 70. C @ 2. min, 2. K/min, 180. C @ 1. min |
Capillary | SPB-5 | 1349. | Kim and Lee, 2001 | 60. m/0.25 mm/0.25 μm, Helium, 50. C @ 3. min, 3. K/min, 240. C @ 10. min |
Capillary | BP-1 | 1358. | Lota, de Rocca Serra, et al., 2001 | 50. m/0.22 mm/0.25 μm, He, 2. K/min, 230. C @ 35. min; Tstart: 60. C |
Capillary | CBP-1 | 1361. | Ly, Yamauchi, et al., 2001 | 25. m/0.25 mm/0.25 μm, Nitrogen, 50. C @ 2. min, 3. K/min; Tend: 210. C |
Capillary | DB-5 | 1383. | Rousis, Papadogianni, et al., 2001 | He, 50. C @ 5. min, 3. K/min; Column length: 60. m; Column diameter: 0.25 mm; Tend: 250. C |
Capillary | DB-5 | 1383.5 | Santos-Gomes and Fernandes-Ferreira, 2001 | 30. m/0.25 mm/0.25 μm, H2, 3. K/min; Tstart: 60. C; Tend: 285. C |
Capillary | SPB-1 | 1385. | Fraternale, Giamperi, et al., 2000 | 30. m/0.2 mm/0.2 μm, He, 80. C @ 3. min, 5. K/min; Tend: 300. C |
Capillary | RSL-200 | 1364. | Jirovetz, Puschmann, et al., 2000 | 60. m/0.32 mm/0.25 μm, H2, 6. K/min; Tstart: 40. C; Tend: 250. C |
Capillary | SPB-5 | 1382. | Kim, Kim, et al., 2000 | 60. m/0.25 mm/0.25 μm, He, 70. C @ 8. min, 5. K/min, 240. C @ 20. min |
Capillary | DB-5 | 1379. | Mitiku, Sawamura, et al., 2000 | 30. m/0.22 mm/0.25 μm, N2, 70. C @ 2. min, 4. K/min, 230. C @ 20. min |
Capillary | SPB-1 | 1359. | Choo, Wong, et al., 1999 | 50. m/0.2 mm/0.33 μm, 4. K/min; Tstart: 60. C; Tend: 260. C |
Capillary | BP-1 | 1359. | Mallavarapu, Kulkarni, et al., 1999 | 25. m/0.50 mm/0.25 μm, N2, 5. K/min, 220. C @ 10. min; Tstart: 60. C |
Capillary | DB-5 | 1375. | Mockute and Bernotiene, 1999 | He, 40. C @ 1. min, 4. K/min; Column length: 30. m; Column diameter: 0.25 mm; Tend: 230. C |
Capillary | OV-1 | 1363. | Oberhofer, Nikiforov, et al., 1999 | 25. m/0.25 mm/0.25 μm, H2, 40. C @ 5. min, 3. K/min, 220. C @ 5. min |
Capillary | DB-1 | 1361. | Sefidkon, Dabiri, et al., 1999 | 60. m/0.25 mm/0.25 μm, He, 40. C @ 5. min, 4. K/min; Tend: 280. C |
Capillary | OV-101 | 1364. | Tropnikova, Zenkevich, et al., 1999 | Nitrogen, 60. C @ 0. min, 4. K/min, 220. C @ 0. min; Column length: 25. m; Column diameter: 0.20 mm |
Capillary | SE-30 | 1363. | Jantan, Ahmad, et al., 1998 | He, 60. C @ 10. min, 3. K/min; Column length: 25. m; Column diameter: 0.2 mm; Tend: 180. C |
Capillary | HP-5 | 1384. | Poiana, Sicari, et al., 1998 | 25. m/0.2 mm/0.33 μm, He, 70. C @ 8. min, 3. K/min, 290. C @ 20. min |
Capillary | CP Sil 5 CB | 1360. | Bos, Woerdenbag, et al., 1997 | 25. m/0.32 mm/0.25 μm, N2, 4. K/min; Tstart: 50. C; Tend: 290. C |
Capillary | CP Sil 5 CB | 1360. | Bos, Woerdenbag, et al., 1997 | 25. m/0.32 mm/0.25 μm, N2, 4. K/min; Tstart: 50. C; Tend: 290. C |
Capillary | DB-5 | 1362. | Reverchon, Porta, et al., 1997 | 30. m/0.25 mm/0.25 μm, He, 50. C @ 5. min, 2. K/min; Tend: 250. C |
Capillary | OV-101 | 1363. | Orav, Kailas, et al., 1996 | He, 2. K/min; Column length: 50. m; Column diameter: 0.25 mm; Tstart: 50. C; Tend: 250. C |
Capillary | BP-1 | 1361. | Rajeswara, Kaul, et al., 1996 | N2, 5. K/min; Column length: 25. m; Column diameter: 0.50 mm; Tstart: 60. C; Tend: 220. C |
Capillary | BP-1 | 1362. | Rajeswara, Kaul, et al., 1996 | N2, 5. K/min; Column length: 25. m; Column diameter: 0.50 mm; Tstart: 60. C; Tend: 220. C |
Capillary | BP-1 | 1363. | Rajeswara, Kaul, et al., 1996 | N2, 5. K/min; Column length: 25. m; Column diameter: 0.50 mm; Tstart: 60. C; Tend: 220. C |
Capillary | DB-1 | 1362. | Sagrero-Nieves and Bartley, 1996 | 60. m/0.32 mm/0.50 μm, He, 50. C @ 1. min, 8. K/min, 250. C @ 6. min |
Capillary | OV-101 | 1361. | Dzumayev, Tsibulskaya, et al., 1995 | He, 3. K/min; Column length: 52. m; Column diameter: 0.26 mm; Tstart: 50. C; Tend: 220. C |
Capillary | OV-101 | 1361. | Orav, Kuningas, et al., 1995 | 50. m/0.2 mm/0.5 μm, He, 1. K/min; Tstart: 70. C; Tend: 180. C |
Capillary | DB-1 | 1359. | Stashenko, Torres, et al., 1995 | 60. m/0.25 mm/0.25 μm, He, 50. C @ 5. min, 3.5 K/min; Tend: 250. C |
Capillary | DB-1 | 1357. | Tirado, Stashenko, et al., 1995 | 60. m/0.25 mm/0.25 μm, He, 70. C @ 5. min, 2.5 K/min; Tend: 270. C |
Capillary | DB-5 MS | 1377. | Gomez and Ledbetter, 1994 | Helium, 4. K/min; Column length: 30. m; Column diameter: 0.25 mm; Tstart: 50. C; Tend: 250. C |
Capillary | Methyl Silicone | 1363. | Gopalakrishnan, Menon, et al., 1993 | 50. m/0.25 mm/0.17 μm, N2, 2. K/min; Tstart: 80. C; Tend: 200. C |
Capillary | Methyl Silicone | 1364. | Gopalakrishnan, Menon, et al., 1993 | 50. m/0.25 mm/0.17 μm, N2, 3. K/min; Tstart: 80. C; Tend: 200. C |
Capillary | OV-101 | 1359. | Tamura, Yang, et al., 1993 | 2. K/min; Column length: 50. m; Column diameter: 0.25 mm; Tstart: 80. C; Tend: 200. C |
Capillary | OV-101 | 1362. | Tamura, Yang, et al., 1993 | 2. K/min; Column length: 50. m; Column diameter: 0.25 mm; Tstart: 80. C; Tend: 200. C |
Capillary | DB-1 | 1357. | Velasco-Negueruela, Pérez Alonso, et al., 1991 | N2, 4. K/min; Column length: 30. m; Tstart: 80. C; Tend: 220. C |
Capillary | OV-101 | 1362. | Yang and Sugisawa, 1990 | N2, 2. K/min; Column length: 50. m; Column diameter: 0.25 mm; Tstart: 80. C; Tend: 200. C |
Capillary | OV-101 | 1364. | Yang and Sugisawa, 1990 | N2, 2. K/min; Column length: 50. m; Column diameter: 0.25 mm; Tstart: 80. C; Tend: 200. C |
Capillary | OV-101 | 1362. | Sugisawa, Yamamoto, et al., 1989 | N2, 2. K/min; Column length: 50. m; Column diameter: 0.25 mm; Tstart: 80. C; Tend: 200. C |
Capillary | OV-1 | 1361. | Wahab, Aboutabl, et al., 1987 | 60. m/0.50 mm/1.2 μm, Helium, 2. K/min; Tstart: 40. C; Tend: 220. C |
Capillary | OV-101 | 1367. | De Pooter and Schamp, 1986 | 30. m/0.5 mm/0.8 μm, He, 2. K/min; Tstart: 40. C; Tend: 220. C |
Capillary | DB-1 | 1358. | Flath, Mon, et al., 1983 | 50. C @ 0.1 min, 4. K/min, 250. C @ 5. min; Column length: 60. m; Column diameter: 0.32 mm |

Normal alkane RI, non-polar column, custom temperature program

Column type | Active phase | I | Reference | Comment |
---|---|---|---|---|
Capillary | RTX-5 MS | 1389. | Pinheiro, de Queiros, et al., 2013 | Helium; Column length: 30. m; Column diameter: 0.25 mm; Program: not specified |
Capillary | RTX-1 | 1360. | Bendiabdellah, El Amine Dib, et al., 2012 | 60. m/0.22 mm/0.25 μm, Helium; Program: not specified |
Capillary | RTX-1 | 1360. | Bendiabdellah, El Amine Dib, et al., 2012 | 60. m/0.22 mm/0.25 μm, Helium; Program: not specified |
Capillary | Siloxane, 5 % Ph | 1383. | VOC BinBase, 2012 | Program: not specified |
Capillary | DB-5 | 1370. | Miyazaki, Plotto, et al., 2011 | 60. m/0.25 mm/1.00 μm, Helium; Program: 40 0C 4 0C/min -> 230 0C 100 0C/min -> 260 0C (11.7 min) |
Capillary | HP-5 MS | 1386. | Nance and Setzer, 2011 | 30. m/0.25 mm/0.25 μm, Helium; Program: 40 0C (10 min) 3 0C/min -> 200 0C 2 0C/min -> 220 0C |
Capillary | Polydimethyl siloxane, 5 % phenyl | 1383. | Skogerson, Wohlgemuth, et al., 2011 | Program: not specified |
Capillary | HP-5 | 1379. | Wang, Liu, et al., 2011 | 30. m/0.25 mm/0.25 μm, Helium; Program: 60 0C (1 min) 10 0C/min -> 180 0C (1 min) 20 0C/min -> 280 0C (15 min) |
Capillary | RTX-1 | 1359. | Dib, Djabou, et al., 2010 | 60. m/0.22 mm/0.25 μm, Helium; Program: not specified |
Capillary | DB-1-MS | 1360. | Takeoka, Hobbs, et al., 2010 | 60. m/0.25 mm/0.25 μm, Helium; Program: not specified |
Capillary | HP-5 MS | 1393. | Dharmawan, Kasapis, et al., 2009 | 60. m/0.32 mm/1.0 μm, Helium; Program: 120 0C 2 0C/min -> 240 0C 10 0C/min -> 270 0C (2 min) |
Capillary | HP-5 MS | 1384. | Keefover-Ring, Thompson, et al., 2009 | 30. m/0.25 mm/0.25 μm, Helium; Program: 50 0C (5 min) 6 0C/min -> 125 0C 10 0C/min -> 170 0C |
Capillary | DB-5 | 1382. | Porto, Decorti, et al., 2009 | 30. m/0.25 mm/0.25 μm, Helium; Program: not specified |
Capillary | DB-5 | 1390. | Porto, Decorti, et al., 2009 | 30. m/0.25 mm/0.25 μm, Helium; Program: not specified |
Capillary | DB-5 | 1381. | Yang, Yang, et al., 2009 | 30. m/0.25 mm/0.25 μm, Helium; Program: 50 0C 95 min) 3 0C/min -> 100 0C 4 0C/min -> 160 0C 5 0C/min -> 220 0C (15 min) |
Capillary | SLB-5 MS | 1380. | Costa, De Fina, et al., 2008 | 30. m/0.25 mm/0.25 μm, Helium; Program: 50 0C 3 0C/min -> 250 0C (1 min) 10 0C/min -> 300 0C (5 min) |
Capillary | SLB-5 MS | 1379. | Costa, De Fina, et al., 2008 | 30. m/0.25 mm/0.25 μm, Helium; Program: not specified |
Capillary | CP Sil 8 CB | 1383. | Kristiawan, Sobolik, et al., 2008 | 30. m/0.25 mm/0.25 μm; Program: 60C => 2.5C/min => 170C => 10C/min => 250C (5min) |
Capillary | HP-5MS | 1360. | Ning, Zheng, et al., 2008 | 30. m/0.25 mm/0.25 μm, He; Program: 40 0C (2 min) 3 0C/min -> 180 0C (2 min) 15 0C -> 280 0C |
Capillary | HP-5 | 1384. | Qiao, Xie, et al., 2008 | 30. m/0.25 mm/0.25 μm, Helium; Program: 40 0C (3 min) 3 0C/min -> 160 0C (2 min) 8 0C/min -> 220 0C (3 min) |
Capillary | HP-5 | 1385. | Qiao, Xie, et al., 2008 | 30. m/0.25 mm/0.25 μm, Helium; Program: not specified |
Capillary | CBP-5 | 1384. | Cheriti, Saad, et al., 2007 | 30. m/0.25 mm/0.25 μm, He; Program: 60C(2min) => 3C/min => 240C => 10C/min => 300C |
Capillary | HP-5MS | 1357. | Chokeprasert P., Charles A.L., et al., 2007 | 30. m/0.25 mm/0.25 μm, He; Program: 40C => 3C/min => 100C => 5C/min => 230C(2min) |
Capillary | BP-5 | 1384. | Hashemi, Abolghasemi, et al., 2007 | 30. m/0.32 mm/0.25 μm, He; Program: 60C => 4C/min => 150C => 10C/min => 220C |
Capillary | DB-1 | 1370. | Kamatou, Viljoen, et al., 2007 | 30. m/0.25 mm/0.25 μm, H2; Program: 45 0C 3 0C/min -> 175 0C 15 0C/min -> 300 0C (10 min) |
Capillary | HP-1 | 1380. | Merle, Verdeguer, et al., 2007 | 30. m/0.2 mm/0.33 μm, He; Program: 60C(5min) => 3C/min => 180C => 20C/min => 280C(10min) |
Capillary | DB-5 | 1381. | Nivinsliene, Butkiene, et al., 2007 | 50. m/0.32 mm/0.25 μm, Helium; Program: 60 0C (1 min) 5 0C/min -> 160 0C 10 0C/min -> 250 0C |
Capillary | CP Sil 8 CB | 1381. | Radusiene, Judzentiene, et al., 2007 | 50. m/0.32 mm/0.25 μm, Helium; Program: 60 0C (2 min) 5 0C/min -> 160 0C (1 min) 10 0C/min -> 280 0C (3 min) |
Capillary | OV-1 | 1362. | Suschke, Sporer, et al., 2007 | 30. m/0.25 mm/0.25 μm, Helium; Program: 40 0C (2 min) 6 0C/min -> 130 0C 10 0C/min -> 300 0C |
Capillary | SPB-5 | 1377. | Chemat, Lucchesi, et al., 2006 | 60. m/0.32 mm/1. μm, He; Program: 60C => 1C/min => 130C => 2C/min => 200C => 4C/min => 250C (40min) |
Capillary | HP-5 | 1386. | Jordan, Martinez, et al., 2006 | 30. m/0.25 mm/0.25 μm, He; Program: 60C(4min) => 1C/min => 64C => 2.5C/min => 155C => 5C/min => 250C |
Capillary | HP-5MS | 1381. | Singh, Marimuthu, et al., 2006 | 30. m/0.25 mm/0.25 μm, He; Program: 60C => 1.5C/min => 185C(1min) => 9C/min => 275C(2min) |
Capillary | HP-5MS | 1382. | Singh G., Maurya S., et al., 2006 | 30. m/0.32 mm/0.25 μm, He; Program: 60C(1min) => 1.5C => 185C => 9C/min => 275C (2min) |
Capillary | DB-5 | 1380. | Srivastava, Mallavarapu, et al., 2006 | 30. m/0.32 mm/0.25 μm, He; Program: 60C => 2C/min => 100C => 3C/min => 160C => 5C/min => 280C |
Capillary | SE-52 | 1381. | Tognolini, Barocelli, et al., 2006 | 30. m/0.32 mm/0.15 μm, He; Program: 45C => 1C/min => 100C => 5C/min => 250C (10min) |
Capillary | DB-5MS | 1380. | Tuberoso, Barra, et al., 2006 | 30. m/0.25 mm/0.25 μm, He; Program: 60C => 3C/min => 180C => 250C (2min) |
Capillary | DB-5MS | 1367. | Bagci and Baser, 2005 | 30. m/0.25 mm/0.25 μm; Program: 70C(2min) => 10C/min => 150C(15min) => 5C/min => 240C |
Capillary | DB-5 | 1383. | Blank, Fontes, et al., 2005 | 30. m/0.25 mm/0.25 μm, He; Program: 80 0C (1 min) 3 0C/min -> 180 0C 10 0C/min -> 300 0C (3 min) |
Capillary | CP Sil 8 CB | 1383. | Judpentienë and Mockutë, 2004 | 50. m/0.32 mm/0.25 μm, He; Program: 60C(2min) => 5C/min => 160C(1min) => 10C/min => 250C (5min) |
Capillary | BPX-5 | 1381. | Koba, Sanda, et al., 2004 | 30. m/0.25 mm/0.25 μm, H2; Program: 50 0C (1 min) 3 0C/min -> 150 0C 5 0C/min -> 250 0C (5 min) |
Capillary | DB-5 | 1379. | Lo Cantore, Iacobellis, et al., 2004 | Program: not specified |
Capillary | DB-1 | 1370. | Miguel, Simões, et al., 2004 | 30. m/0.25 mm/0.25 μm, He; Program: 45C => 3C/min => 175C => 15C/min => 300C (10min) |
Capillary | SE-30 | 1363. | Vinogradov, 2004 | Program: not specified |
Capillary | SE-30 | 1364. | Vinogradov, 2004 | Program: not specified |
Capillary | DB-1 | 1370. | Faleiro, Miguel, et al., 2003 | 30. m/0.25 mm/0.25 μm, He; Program: 45C => 3C/min => 175C => 15C/min => 300C (10min) |
Capillary | HP-5 | 1386. | Jordán, Martínez, et al., 2003 | 30. m/0.25 mm/0.25 μm, He; Program: 60C (4min) => 1C/min => 64C => 2.5C/min => 155C => 5C/min => 250C |
Capillary | SE-30 | 1364. | Li, Wu, et al., 2002 | He; Column length: 60. m; Column diameter: 0.25 mm; Program: 50 0C (5 min) 5 0C/min -> 165 0C 4 0C/min -> 230 0C |
Capillary | SE-30 | 1364. | Li, Wu, et al., 2002 | He; Column length: 60. m; Column diameter: 0.25 mm; Program: not specified |
Capillary | DB-1 | 1370. | Figueiredo, Miguel, et al., 2001 | 30. m/0.25 mm/0.25 μm; Program: 45 0C 3 K/min -> 175 0C 15 K/min -> 300 0C (10 min) |
Capillary | CP Sil 5 CB | 1360. | Lermusieau, Bulens, et al., 2001 | 50. m/0.32 mm/1.2 μm; Program: 36C => 20C/min => 120C(20min) => 2C/min => 250C(30min) |
Capillary | CBP-1 | 1363. | Ly, Yamauchi, et al., 2001 | 25. m/0.25 mm/0.25 μm, Nitrogen; Program: not specified |
Capillary | DB-5 | 1381. | Petrakis, Tsitsimpikou, et al., 2001 | Program: not specified |
Capillary | DB-1 | 1370. | Dorman, Figueiredo, et al., 2000 | 30. m/0.25 mm/0.25 μm, H2; Program: 40 0C 3 K/min -> 175 0C 15 K/min -> 240 0C (10 min) |
Capillary | CP Sil 5 CB | 1361. | Weyerstahl, Marschall, et al., 1999 | 25. m/0.25 mm/0.39 μm, N2; Program: not specified |
Capillary | CP Sil 5 CB | 1359. | Weyerstahl, Marschall, et al., 1999, 2 | Column length: 25. m; Column diameter: 0.39 mm; Program: not specified |
Capillary | Methyl Silicone | 1361. | Zenkevich, 1999 | Program: not specified |
Capillary | DB-1 | 1370. | Baratta, Dorman, et al., 1998 | 30. m/0.25 mm/0.25 μm, He; Program: 45C => 3C/min => 175C => 15C/min => 240C (10min) |
Capillary | DB-5 | 1382. | Anitescu, Doneanu, et al., 1997 | 15. m/0.25 mm/0.25 μm, He; Program: 40C(5min) => 5C/min => 120C(10min) => 4C/min => 250C(4min) => 5C/min => 280C |
Capillary | DB-5 | 1383. | Isidorov, Zenkevich, et al., 1997 | Program: not specified |
Capillary | OV-101 | 1364. | Shibamoto, 1987 | Program: not specified |
Packed | OV-101 | 1361. | Swigar and Silverstein, 1981 | N2, Chromosorb G 60-80mesh DMCS; Column length: 2.5 m; Program: not specified |

Normal alkane RI, polar column, temperature ramp

Column type | Active phase | I | Reference | Comment |
---|---|---|---|---|
Capillary | RTX-Wax | 1715. | Bendiabdellah, El Amine Dib, et al., 2012 | 60. m/0.22 mm/0.25 μm, Helium, 2. K/min, 230. C @ 5. min; Tstart: 60. C |
Capillary | HP-Innowax | 1765. | Menichini, Tundis, et al., 2011 | 30. m/0.25 mm/0.25 μm, Helium, 50. C @ 5. min, 5. K/min, 250. C @ 10. min |
Capillary | RTX-Wax | 1759. | Dib, Djabou, et al., 2010 | 60. m/0.22 mm/0.25 μm, Helium, 2. K/min, 230. C @ 30. min; Tstart: 60. C |
Capillary | BP-20 | 1750. | Mishra, Chaudhary, et al., 2010 | Nitrogen, 5. K/min; Tstart: 60. C; Tend: 200. C |
Capillary | DB-Wax | 1794. | Miyazawa, Kawauchi, et al., 2010 | 15. m/0.25 mm/0.25 μm, Helium, 4. K/min, 260. C @ 5. min; Tstart: 40. C |
Capillary | DB-Wax | 1773. | Vahirua-Lechat, Mitermite, et al., 2010 | 30. m/0.25 mm/0.25 μm, Helium, 3. K/min, 240. C @ 2. min; Tstart: 80. C |
Capillary | BP-20 | 1761. | Ottavioli, Bighelli, et al., 2009 | 50. m/0.22 mm/0.25 μm, Helium, 2. K/min, 220. C @ 20. min; Tstart: 60. C |
Capillary | Innowax | 1764. | Seo, Kim, et al., 2009 | 30. m/0.25 mm/0.25 μm, Helium, 40. C @ 1. min, 6. K/min, 250. C @ 4. min |
Capillary | HP-Innowax | 1765. | Wannes, Mhamdi, et al., 2009 | 30. m/0.25 mm/0.52 μm, Nitrogen, 35. C @ 10. min, 3. K/min, 205. C @ 10. min |
Capillary | Carbowax | 1742. | Ferhat, Meklati, et al., 2007 | 60. m/0.2 mm/0.25 μm, He, 60. C @ 8. min, 2. K/min, 250. C @ 15. min |
Capillary | Carbowax | 1720. | Ferhat, Tigrine-Kordjani, et al., 2007 | 60. m/0.2 mm/0.25 μm, He, 60. C @ 8. min, 2. K/min, 250. C @ 15. min |
Capillary | PEG-20M | 1752. | Gil A., Van Baren C.M., et al., 2007 | 60. m/0.25 mm/0.25 μm, He, 3. K/min, 225. C @ 15. min; Tstart: 90. C |
Capillary | TC-FFAP | 1769. | Kurose, Okamura, et al., 2007 | He, 3. K/min, 220. C @ 30. min; Column diameter: 0.25 mm; Phase thickness: 0.25 μm; Tstart: 60. C |
Capillary | Supelcowax-10 | 1769. | Sylvestre, Pichette, et al., 2007 | 30. m/0.25 mm/0.25 μm, 2. K/min, 250. C @ 33. min; Tstart: 40. C |
Capillary | DB-Wax | 1751. | Cai, Lin, et al., 2006 | 60. m/0.25 mm/0.5 μm, He, 50. C @ 2. min, 3. K/min, 230. C @ 20. min |
Capillary | DB-Wax | 1768. | Choi H.S., 2006 | 60. m/0.25 mm/0.25 μm, He, 70. C @ 2. min, 2. K/min, 230. C @ 20. min |
Capillary | BP-20 | 1748. | Fanciullino, Tomi, et al., 2006 | 50. m/0.22 mm/0.25 μm, He, 2. K/min, 220. C @ 20. min; Tstart: 60. C |
Capillary | BP-20 | 1748. | Fanciullino, Tomi, et al., 2006 | 50. m/0.22 mm/0.25 μm, He, 2. K/min, 220. C @ 20. min; Tstart: 60. C |
Capillary | CP-Wax 52CB | 1731. | Hymete, Rohloff, et al., 2006 | 30. m/0.32 mm/0.25 μm, He, 60. C @ 7. min, 3.3 K/min, 220. C @ 3. min |
Capillary | DB-Wax | 1754. | Lan Phi N.T., Nishiyama C., et al., 2006 | 60. m/0.25 mm/0.25 μm, 70. C @ 2. min, 2. K/min, 230. C @ 20. min |
Capillary | DB-Wax | 1752. | Lan Phi N.T., Nishiyama C., et al., 2006 | 60. m/0.25 mm/0.25 μm, 70. C @ 2. min, 2. K/min, 230. C @ 20. min |
Capillary | NB-20M | 1754. | Orav, Raal, et al., 2006 | 30. m/0.2 mm/0.25 μm, He, 2. K/min; Tstart: 50. C; Tend: 250. C |
Capillary | DB-Wax | 1756. | Sawamura, Onishi, et al., 2006 | 60. m/0.25 mm/0.25 μm, 70. C @ 2. min, 2. K/min, 230. C @ 20. min |
Capillary | Supelcowax-10 | 1751. | Wong, Lim, et al., 2006 | 30. m/0.25 mm/0.25 μm, He, 50. C @ 1. min, 4. K/min, 220. C @ 10. min |
Capillary | Carbowax 20M | 1735. | Babu and Kaul, 2005 | 60. m/0.25 mm/0.25 μm, N2, 40. C @ 2. min, 10. K/min, 190. C @ 15. min |
Capillary | DB-Wax | 1760. | Hamilton, Hall, et al., 2005 | 30. m/0.25 mm/0.2 μm, 60. C @ 2. min, 6. K/min; Tend: 250. C |
Capillary | Stabilwax | 1751. | Jirovetz, Buchbauer, et al., 2005 | 30. m/0.32 mm/0.5 μm, H2, 40. C @ 5. min, 6. K/min, 280. C @ 5. min |
Capillary | Stabilwax | 1752. | Jirovetz, Buchbauer, et al., 2005, 2 | 30. m/0.32 mm/0.5 μm, 40. C @ 5. min, 6. K/min, 280. C @ 5. min |
Capillary | Innowax | 1763. | Joichi, Yomogida, et al., 2005 | 60. m/0.25 mm/0.25 μm, He, 5. K/min, 240. C @ 30. min; Tstart: 60. C |
Capillary | HP-20M | 1729. | Kulisic, Radonic, et al., 2005 | 50. m/0.20 mm/0.20 μm, Helium, 70. C @ 4. min, 4. K/min, 180. C @ 10. min |
Capillary | DB-Wax | 1769. | Njoroge, Koaze, et al., 2005 | 60. m/0.25 mm/0.25 μm, N2, 70. C @ 2. min, 2. K/min, 230. C @ 20. min |
Capillary | PE-Wax | 1753. | Ram, Kumar, et al., 2005 | 50. m/0.32 mm/0.25 μm, H2, 4. K/min, 220. C @ 2. min; Tstart: 60. C |
Capillary | Supelcowax-10 | 1772. | Vichi, Riu-Aumatell, et al., 2005 | 30. m/0.25 mm/0.25 μm, 40. C @ 5. min, 3. K/min, 220. C @ 10. min |
Capillary | DB-Wax | 1766. | Choi, 2004 | 60. m/0.25 mm/0.25 μm, N2, 70. C @ 2. min, 2. K/min, 230. C @ 20. min |
Capillary | DB-Wax | 1768. | Choi, 2004, 2 | 60. m/0.25 mm/0.25 μm, N2, 70. C @ 2. min, 2. K/min, 230. C @ 20. min |
Capillary | DB-Wax | 1760. | Jiang and Kubota, 2004 | He, 60. C @ 4. min, 2. K/min; Column length: 60. m; Column diameter: 0.25 mm; Tend: 220. C |
Capillary | DB-Wax | 1760. | Jiang and Kubota, 2004 | He, 60. C @ 4. min, 2. K/min; Column length: 60. m; Column diameter: 0.25 mm; Tend: 220. C |
Capillary | Supelcowax-10 | 1742. | Lopez Arze, Collin, et al., 2004 | 30. m/0.25 mm/0.25 μm, 40. C @ 2. min, 2. K/min, 210. C @ 33. min |
Capillary | Innowax FSC | 1765. | Lourens, Reddy, et al., 2004 | Helium, 60. C @ 10. min, 4. K/min; Column length: 60. m; Column diameter: 0.25 mm; Tend: 220. C |
Capillary | PEG-20M | 1705. | Narain, Almeida, et al., 2004 | 50. m/0.20 mm/0.20 μm, 40. C @ 5. min, 3. K/min, 180. C @ 30. min |
Capillary | NB-20M | 1758. | Raal, Arak, et al., 2004 | 50. m/0.2 mm/0.25 μm, He, 2. K/min; Tstart: 50. C; Tend: 250. C |
Capillary | SW-10 | 1732. | Raal, Paaver, et al., 2004 | 50. m/0.20 mm/0.25 μm, He, 2. K/min; Tstart: 50. C; Tend: 230. C |
Capillary | DB-Wax | 1767. | Sawamura, Son, et al., 2004 | 60. m/0.25 mm/0.25 μm, 70. C @ 2. min, 2. K/min, 230. C @ 20. min |
Capillary | DB-Wax | 1767. | Sawamura, Sou, et al., 2004 | 60. m/0.25 mm/0.25 μm, Nitrogen, 70. C @ 2. min, 2. K/min; Tend: 230. C |
Capillary | HP-20M | 1745. | Juteau, Jerkovic, et al., 2003 | 50. m/0.2 mm/0.2 μm, He, 70. C @ 4. min, 4. K/min, 180. C @ 10. min |
Capillary | HP-20M | 1729. | Mastelic and Jerkovic, 2003 | 50. m/0.2 mm/0.2 μm, He, 70. C @ 4. min, 4. K/min, 180. C @ 10. min |
Capillary | PEG 20M | 1745. | Nakahara, Alzoreky, et al., 2003 | 70. C @ 2. min, 5. K/min; Tend: 180. C |
Capillary | Innowax | 1765. | Suleimenov, Atazharova, et al., 2003 | He, 60. C @ 10. min, 4. K/min, 220. C @ 10. min; Column length: 60. m; Column diameter: 0.25 mm |
Capillary | DB-Wax | 1738. | Tu, Onishi, et al., 2003 | 60. m/0.25 mm/0.25 μm, N2, 70. C @ 2. min, 2. K/min, 230. C @ 20. min |
Capillary | DB-Wax | 1740. | Tu, Onishi, et al., 2003, 2 | 60. m/0.25 mm/0.25 μm, N2, 70. C @ 2. min, 2. K/min, 230. C @ 20. min |
Capillary | DB-Wax | 1750. | Gancel, Ollé, et al., 2002 | 60. m/0.32 mm/0.25 μm, H2, 1.5 K/min, 245. C @ 20. min; Tstart: 40. C |
Capillary | Supelcowax-10 | 1755. | Orav, Kailas, et al., 2002 | 60. m/0.2 mm/0.5 μm, He, 2. K/min; Tstart: 70. C; Tend: 220. C |
Capillary | DB-Wax | 1745. | Tu, Onishi, et al., 2002 | 60. m/0.25 mm/0.25 μm, N2, 70. C @ 2. min, 2. K/min, 230. C @ 20. min |
Capillary | DB-Wax | 1760. | Tu, Thanh, et al., 2002 | 60. m/0.25 mm/0.25 μm, N2, 2. K/min; Tstart: 70. C; Tend: 230. C |
Capillary | DB-Wax | 1756. | Christoph, 2001 | 60. m/0.25 mm/0.25 μm, He, 3. K/min; Tstart: 45. C; Tend: 240. C |
Capillary | DB-Wax | 1760. | Jiang and Kubota, 2001 | He, 2. K/min; Column length: 60. m; Column diameter: 0.25 mm; Tstart: 40. C; Tend: 220. C |
Capillary | BP-20 | 1748. | Lota, de Rocca Serra, et al., 2001 | 50. m/0.22 mm/0.25 μm, He, 2. K/min, 230. C @ 35. min; Tstart: 60. C |
Capillary | DB-Wax | 1755. | Buttery, Light, et al., 2000 | 60. m/0.25 mm/0.25 μm, 30. C @ 4. min, 2. K/min, 170. C @ 30. min |
Capillary | CP-Wax 52CB | 1750. | Chagonda, Makanda, et al., 2000 | 50. m/0.30 mm/0.25 μm, He, 40. C @ 5. min, 3. K/min; Tend: 220. C |
Capillary | CP-Wax 52CB | 1768. | Chagonda, Makanda, et al., 2000 | 50. m/0.30 mm/0.25 μm, He, 40. C @ 5. min, 3. K/min; Tend: 220. C |
Capillary | Supelcowax-10 | 1742. | Kim, Kim, et al., 2000 | 30. m/0.32 mm/0.25 μm, He, 70. C @ 8. min, 5. K/min, 240. C @ 20. min |
Capillary | Supelcowax-10 | 1747. | Korány, Mednyánszky, et al., 2000 | 60. m/0.25 mm/0.25 μm, He, 4. K/min; Tstart: 60. C; Tend: 280. C |
Capillary | Supelcowax-10 | 1742. | Choo, Wong, et al., 1999 | 30. m/0.25 mm/0.25 μm, 4. K/min; Tstart: 60. C; Tend: 220. C |
Capillary | Innowax | 1765. | Kaya, Baser, et al., 1999 | 60. m/0.25 mm/0.25 μm, He, 60. C @ 10. min; Tend: 220. C |
Capillary | FFAP | 1785. | Mockute and Bernotiene, 1999 | He, 70. C @ 10. min, 3. K/min; Column length: 25. m; Column diameter: 0.2 mm; Tend: 210. C |
Capillary | DB-Wax | 1753. | Ngassoum, Yonkeu, et al., 1999 | 60. m/0.25 mm/0.25 μm, He, 4. K/min; Tstart: 60. C; Tend: 240. C |
Capillary | DB-Wax | 1784. | Molleken U., Sinnwell V., et al., 1998 | 30. m/0.25 mm/0.25 μm, N2, 3. K/min; Tstart: 45. C; Tend: 220. C |
Capillary | DB-Wax | 1766. | Mölleken, Sinnwell, et al., 1998 | 30. m/0.25 mm/0.25 μm, N2, 3. K/min; Tstart: 45. C; Tend: 220. C |
Capillary | PEG-20M | 1763. | Awano, Honda, et al., 1997 | He, 3. K/min; Column length: 60. m; Column diameter: 0.25 mm; Tstart: 70. C; Tend: 210. C |
Capillary | PEG-20M | 1755. | Orav, Kailas, et al., 1996 | He, 2. K/min; Column length: 50. m; Column diameter: 0.25 mm; Tstart: 70. C; Tend: 250. C |
Capillary | DB-Wax | 1752. | Sagrero-Nieves and Bartley, 1996 | 60. m/0.32 mm/0.50 μm, He, 50. C @ 1. min, 8. K/min, 250. C @ 6. min |
Capillary | Supelcowax-10 | 1711. | Nishimura, 1995 | 30. m/0.53 mm/1. μm, He, 3. K/min; Tstart: 80. C; Tend: 210. C |
Capillary | PEG-20M | 1765. | Orav, Kuningas, et al., 1995 | 60. m/0.32 mm/0.25 μm, He, 70. C @ 7. min, 2. K/min; Tend: 180. C |
Capillary | DB-Wax | 1728. | Stashenko, Torres, et al., 1995 | 60. m/0.25 mm/0.25 μm, He, 50. C @ 5. min, 2.5 K/min; Tend: 180. C |
Capillary | DB-Wax | 1743. | Takeoka, Buttery, et al., 1991 | 60. m/0.32 mm/0.25 μm, He, 30. C @ 4. min, 2. K/min, 180. C @ 25. min |

Normal alkane RI, polar column, custom temperature program

Column type | Active phase | I | Reference | Comment |
---|---|---|---|---|
Capillary | Supelco CO Wax-10 | 1758. | Prompona, Kandylis, et al., 2012 | 60. m/0.32 mm/0.25 μm, Helium; Program: 35 0C (6 min) 2 0C/min -> 60 0C (5 min) 5 0C/min -> 200 0C 25 0C/min -> 250 0C (6 min) |
Capillary | Innowax FSC | 1765. | Baser, Demirci, et al., 2009 | 60. m/0.25 mm/0.25 μm, Helium; Program: 60 0C (10 min) 4 0C/min -> 220 0C (10 min) 1 0C/min -> 240 0C |
Capillary | DB-Wax | 1740. | Gyawali and Kim, 2009 | 60. m/0.25 mm/0.25 μm, Helium; Program: 40 0C (3 min) 2 0C/min -> 150 0C 4 0C/min -> 220 0C (20 min) |
Capillary | DB-Wax | 1730. | Keefover-Ring, Thompson, et al., 2009 | 15. m/0.25 mm/0.25 μm, Helium; Program: 50 0C (5 min) 6 0C/min -> 125 0C 10 0C/min -> 170 0C |
Capillary | DB-Wax | 1744. | Keefover-Ring, Thompson, et al., 2009 | 15. m/0.25 mm/0.25 μm, Helium; Program: 50 0C (5 min) 6 0C/min -> 125 0C 10 0C/min -> 170 0C |
Capillary | DB-Wax | 1749. | Rowan, Hunt, et al., 2009 | 20. m/0.18 mm/0.18 μm, Helium; Program: 35 0C (1 min) 2/9 0C/min -> 100 0C 8 0C/min -> 200 0C (5 min) |
Capillary | Innowax | 1758. | Aicha, Ines, et al., 2008 | 30. m/0.25 mm/0.25 μm, Helium; Program: not specified |
Capillary | Carbowax 20M | 1759. | Merle, Verdeguer, et al., 2007 | He; Column length: 30. m; Program: 60C(5min) => 3C/min => 180C => 20C/min => 280C(10min) |
Capillary | HP-Innowax | 1712. | Quijano and Pino, 2006 | 60. m/0.25 mm/0.25 μm, Nitrogen; Program: 50 0C (4 min) -> 40 0C 4 0C/min -> 220 0C |
Capillary | HP-Innowax FSC | 1765. | Suleimenov Y.M., Atazhanova G.A., et al., 2006 | 60. m/0.25 mm/0.25 μm, He; Program: 60(10min) => 4C/min => 220C(10min) => 1C/min => 240C |
Capillary | Innowax FSC | 1765. | Kosar, Özek, et al., 2005 | 60. m/0.25 mm/0.25 μm, He; Program: 60C(10min) => 4C/min => 220C(10min) => 1C/min => 240C |
Capillary | HP-Innowax FSC | 1765. | Tabanca, Demirci, et al., 2005 | 60. m/0.25 mm/0.25 μm, He; Program: 60C(10min) => 4C/min => 220C(10min) => 1C/min => 240C |
Capillary | HP-Innowax FSC | 1765. | Demirci, Paper, et al., 2004 | 60. m/0.25 mm/0.25 μm, He; Program: 60C(10min) => 4C/min => 220C(10min) => 1C/min => 240C |
Capillary | Carbowax 20M | 1750. | Vinogradov, 2004 | Program: not specified |
Capillary | Carbowax 20M | 1735. | Vinogradov, 2004 | Program: not specified |
Capillary | HP-Innowax FSC | 1765. | Demirci, Baser, et al., 2003 | 60. m/0.25 mm/0.25 μm, He; Program: 60C (10min) => 4C/min => 220C (10min) => 1C/min => 240C |
Capillary | HP-Innowax FSC | 1765. | Kürkcüoglu, Demirci, et al., 2003 | 60. m/0.25 mm/0.25 μm, He; Program: 60C(10min) => 4C/min => 220C(10min) => 1C/min => 240C(40min) |
Capillary | HP-Innowax | 1765. | Demirci, Baser, et al., 2002 | 60. m/0.25 mm/0.25 μm, He; Program: 60 0C (10 min) 4 K/min -> 220 0C (10 min) 1 K/min -> 240 0C |
Capillary | Supelcowax-10 | 1772. | Kim and Lee, 2002 | 60. m/0.25 mm/0.25 μm, He; Program: 40C (7min) => 4C/min => 150C => 8C/min => 240C (10min) |
Capillary | HP-Innowax | 1765. | Baser, Demirci, et al., 2001 | 60. m/0.25 mm/0.25 μm, He; Program: 60 0C (10 min) 10 K/min -> 220 0C (10 min) 1K/min -> 240 0C |
Capillary | HP-Innowax FSC | 1765. | Kaya, Demirci, et al., 2001 | 60. m/0.25 mm/0.25 μm; Program: 60C(10min) => 4C/min => 220C(10min) => 1C/min => 240C |
Capillary | HP-Innowax FSC | 1765. | Kirimer N., Tabanea N., et al., 2001 | 60. m/0.25 mm/0.25 μm, He; Program: 60C(10min) => 4C/min => 220C(10min) => 1C/min => 240C |
Capillary | HP-Innowax FSC | 1765. | Tabanca, Kirimer, et al., 2001 | 60. m/0.25 mm/0.25 μm; Program: 60C(10min) => 4C/min => 220C(10min) => 1C/min => 240C |
Capillary | HP-Innowax | 1765. | Tabanca, Kirimer, et al., 2001, 2 | 60. m/0.25 mm/0.25 μm, He; Program: 60C(10min) => 4C/min => 220C(10min) => 1C/min => 240C |
Capillary | FFAP | 1740. | Tucker, Maciarello, et al., 2001 | 50. m/0.2 mm/0.33 μm; Program: 60C(1min) => 2.5C/min => 115C => 1C/min => 210C(30min) |
Capillary | Innowax | 1765. | Ahmed, Choudhary, et al., 2000 | He; Column length: 60. m; Column diameter: 0.25 mm; Program: 60 0C (10 min) 4 K/min -> 220 0C (10 min) 1 K/min -> 240 0C |
Capillary | Innowax | 1765. | Baser, Tabanca, et al., 2000 | 60. m/0.25 mm/0.25 μm, He; Program: 60 0C (10 min) 4 K/min -> 220 0C (10 min) 1 K/min -> 240 0C |
Capillary | Carbowax 20M | 1746. | Tirado, Stashenko, et al., 1995 | 60. m/0.25 mm/0.25 μm, He; Program: not specified |
Capillary | NB-351 | 1754. | Kerrola and Kallio, 1993 | 25. m/0.32 mm/0.2 μm; Program: 40C(5min) => 4C/min => 150C => 8C/min => 240C(12min) |
Capillary | CP-Wax 52CB | 1724. | Vernin, 1991 | Column length: 50. m; Column diameter: 0.32 mm; Program: not specified |
Capillary | Carbowax 20M | 1735. | Shibamoto, 1987 | Program: not specified |

References

Aldrich Chemical Company Inc., 1990
Aldrich Chemical Company Inc.,
Catalog Handbook of Fine Chemicals, Aldrich Chemical Company, Inc., Milwaukee WI, 1990, 1. [all data]
Stephenson and Malanowski, 1987
Stephenson, Richard M.; Malanowski, Stanislaw,
Handbook of the Thermodynamics of Organic Compounds, 1987, https://doi.org/10.1007/978-94-009-3173-2
. [all data]
Stull, 1947
Stull, Daniel R.,
Vapor Pressure of Pure Substances. Organic and Inorganic Compounds,
Ind. Eng. Chem., 1947, 39, 4, 517-540, https://doi.org/10.1021/ie50448a022
. [all data]
Tudor, 1997
Tudor, E.,
Temperature dependence of the retention index for perfumery compounds on a SE-30 glass capillary column. I. Linear equations,
J. Chromatogr. A, 1997, 779, 1-2, 287-297, https://doi.org/10.1016/S0021-9673(97)00453-6
. [all data]
Sakai, Maarse, et al., 1967
Sakai, T.; Maarse, H.; Kepner, R.E.; Jennings, W.G.; Longhurst, W.M.,
Volatile components of Douglas fir needles,
J. Agric. Food Chem., 1967, 15, 6, 1070-1072, https://doi.org/10.1021/jf60154a027
. [all data]
Allegrone, Belliardo, et al., 2006
Allegrone, G.; Belliardo, F.; Cabella, P.,
Comparison of volatile concentrations in hand-squeezed juices of four different lemon varieties,
J. Agric. Food Chem., 2006, 54, 5, 1844-1848, https://doi.org/10.1021/jf051206s
. [all data]
Hazzit, Baaliouamer, et al., 2006
Hazzit, M.; Baaliouamer, A.; Faleiro, M.L.; Miguel, M.G.,
Composition of the Essential Oils of Thymus and Origanum Species from Algeria and Their Antioxidant and Antimicrobial Activities,
J. Agric. Food Chem., 2006, 54, 17, 6314-6321, https://doi.org/10.1021/jf0606104
. [all data]
Jalali-Heravi, Zekavat, et al., 2006
Jalali-Heravi, M.; Zekavat, B.; Sereshti, H.,
Characterization of essential oil components of Iranian geranium oil using gas chromatography-mass spectrometry combined with chemometric resolution techniques,
J. Chromatogr. A, 2006, 1114, 1, 154-163, https://doi.org/10.1016/j.chroma.2006.02.034
. [all data]
Marongiu, Porcedda, et al., 2006
Marongiu, B.; Porcedda, S.; Piras, A.; Sanna, G.; Murreddu, M.; Loddo, R.,
Extraction of Juniperus communis L. ssp. nana Willd. essential oil by supercritical carbon dioxide,
Flavour Fragr. J., 2006, 21, 1, 148-154, https://doi.org/10.1002/ffj.1549
. [all data]
Oliveira, Leitao, et al., 2006
Oliveira, D.R.; Leitao, G.G.; Santos, S.S.; Bizzo, H.R.; Lopes, D.; Alviano, C.S.; Alviano, D.S.; Leitao, S.G.,
Ethnopharmacological study of two Lippia species from Oriximina, Brazil,
J. Ethnopharmacol., 2006, 108, 1, 103-108, https://doi.org/10.1016/j.jep.2006.04.018
. [all data]
Tayoub, Schwob, et al., 2006
Tayoub, G.; Schwob, I.; Bessiere, J.-M.; Masotti, V.; Rabier, J.; Ruzzier, M.; Viano, J.,
Composition of volatile oils of Styrax (Styrax officinalis L.) leaves at different phenological stages,
Biochem. Syst. Ecol., 2006, 34, 9, 705-709, https://doi.org/10.1016/j.bse.2006.05.008
. [all data]
Tayoub, Schwob, et al., 2006, 2
Tayoub, G.; Schwob, I.; Bessière, J.-M.; Rabier, J.; Masotti, V.; J.; M.; Girard, G.; Viano, J.,
Essential oil composition of leaf, flower and stem of Styrax (Styrax officinalis L.) from south-eastern France,
Flavour Fragr. J., 2006, 21, 5, 809-812, https://doi.org/10.1002/ffj.1731
. [all data]
Adams, Morris, et al., 2005
Adams, R.P.; Morris, J.A.; Pandey, R.N.; Schwarzbach, A.E.,
Cryptic speciation between Juniperus deltoides and Juniperus oxycedrus (Cupressaceae) in the Mediterranean,
Biochem. Syst. Ecol., 2005, 33, 8, 771-787, https://doi.org/10.1016/j.bse.2005.01.001
. [all data]
Asuming, Beauchamp, et al., 2005
Asuming, W.A.; Beauchamp, P.S.; Descalzo, J.T.; Dev, B.C.; Dev, V.; Frost, S.; Ma, C.W.,
Essential oil composition of four Lomatium Raf. species and their chemotaxonomy,
Biochem. Syst. Ecol., 2005, 33, 1, 17-26, https://doi.org/10.1016/j.bse.2004.06.005
. [all data]
Baranauskiene, Venskutonis, et al., 2005
Baranauskiene, R.; Venskutonis, R.P.; Demyttenaere, J.C.R.,
Sensory and instrumental evaluation of sweet marjoram (Origanum majorana L.) aroma,
Flavour Fragr. J., 2005, 20, 5, 492-500, https://doi.org/10.1002/ffj.1478
. [all data]
Rajeswara Rao, Kaul, et al., 2005
Rajeswara Rao, B.R.; Kaul, P.N.; Syamasundar, K.V.; Ramesh, S.,
Chemical profiles of primary and secondary essential oils of palmarosa (Cymbopogon martinii (Roxb.) Wats var. motia Burk.),
Ind. Crops Prod., 2005, 21, 1, 121-127, https://doi.org/10.1016/j.indcrop.2004.02.002
. [all data]
Rao, Kaul, et al., 2005
Rao, B.R.R.; Kaul, P.N.; Syamasundar, K.V.; Ramesh, S.,
Chemical profiles of primary and secondary essential oils of palmarosa (Cymbopogon martinii (Roxb.) Wats var. motia Burk.),
Ind. Crops Prod., 2005, 21, 1, 121-127, https://doi.org/10.1016/j.indcrop.2004.02.002
. [all data]
Avato, Raffo, et al., 2004
Avato, P.; Raffo, F.; Aldouri, N.A.; Vartanian, S.T.,
Essential oils of varthemia iphionoides from Jordan,
Flavour Fragr. J., 2004, 19, 6, 559-561, https://doi.org/10.1002/ffj.1351
. [all data]
Ogunwande, Olawore, et al., 2004
Ogunwande, I.A.; Olawore, N.O.; Adeleke, K.A.; Ekundayo, O.; König, W.A.,
Rare terpenoid esters from Hyparrhenia rufa (Nees) Stapf. growing wild in Nigeria,
Flavour Fragr. J., 2004, 19, 3, 239-243, https://doi.org/10.1002/ffj.1295
. [all data]
Yadav, Chauhan, et al., 2004
Yadav, A.R.; Chauhan, A.S.; Rekha, M.N.; Rao, L.J.M.; Ramteke, R.S.,
Flavour quality of dehydrated lime [Citrus aurantifolia (Christm.) Swingle],
Food Chem., 2004, 85, 1, 59-62, https://doi.org/10.1016/j.foodchem.2003.06.002
. [all data]
Baranauskiene, Venskutonis, et al., 2003
Baranauskiene, R.; Venskutonis, R.P.; Demyttenaere, J.C.R.,
Sensory and instrumental evaluation of catnip (Nepeta cataria L.) aroma,
J. Agric. Food Chem., 2003, 51, 13, 3840-3848, https://doi.org/10.1021/jf021187b
. [all data]
Bouzouita, Kachouri, et al., 2003
Bouzouita, N.; Kachouri, F.; Hamdi, M.; Chaabouni, M.M.,
Antimicrobial activity of essential oils from Tunisian aromatic plants,
Flavour Fragr. J., 2003, 18, 5, 380-383, https://doi.org/10.1002/ffj.1200
. [all data]
Srivastava, Ahmad, et al., 2003
Srivastava, S.K.; Ahmad, A.; Syamsunder, K.V.; Aggarwal, K.K.; Shanuja, S.P.S.,
Essential oil composition of Callistemon viminalis leaves from India,
Flavour Fragr. J., 2003, 18, 5, 361-363, https://doi.org/10.1002/ffj.1143
. [all data]
Mevy, Bessiere, et al., 2002
Mevy, J.P.; Bessiere, J.-M.; Dherbomez, M.; Viano, J.,
Composition and some biological activities of the essential oils from an African pasture grass: Elionurus elegans Kunth.,
J. Agric. Food Chem., 2002, 50, 15, 4240-4243, https://doi.org/10.1021/jf0115140
. [all data]
Raina, Srivastava, et al., 2002
Raina, V.K.; Srivastava, S.K.; Jain, N.; Ahmad, A.; Syamasundar, K.V.; Aggarwal, K.K.,
Essential oil composition of Curcuma longa L. cv. Roma from the plains of northern India,
Flavour Fragr. J., 2002, 17, 2, 99-102, https://doi.org/10.1002/ffj.1053
. [all data]
Rajeswara Rao, 2002
Rajeswara Rao, B.R.,
Biomass yield, essential oil yield and essential oil composition of rose-scented geranium (Pelargonium species) as influenced by row spacings and intercropping with cornmint (Mentha arvensis L.f. piperascens Malinv. ex Holmes),
Ind. Crops Prod., 2002, 16, 2, 133-144, https://doi.org/10.1016/S0926-6690(02)00038-9
. [all data]
Rao B.R.R., 2002
Rao B.R.R.,
Biomass yield, essential oil yield and essential oil composition of rose-scented geranium (Pelargonium species) as influenced by row spacings and intercropping with cornmint (Mentha arvensis L.f. piperascens Malinv. ex Holmes),
Industrial Crops and Products, 2002, 16, 2, 133-144, https://doi.org/10.1016/S0926-6690(02)00038-9
. [all data]
Akrout, Chemli, et al., 2001
Akrout, A.; Chemli, R.; Chreïf, I.; Hammami, M.,
Analysis of the essential oil of Artemisia campestris L.,
Flavour Fragr. J., 2001, 16, 5, 337-339, https://doi.org/10.1002/ffj.1006
. [all data]
Jain, Aggarwal, et al., 2001
Jain, N.; Aggarwal, K.K.; Syamasundar, K.V.; Srivastava, S.K.; Kumar, S.,
Essential oil composition of geranium (Pelargonium sp.) from the plains of Northern India,
Flavour Fragr. J., 2001, 16, 1, 44-46, https://doi.org/10.1002/1099-1026(200101/02)16:1<44::AID-FFJ943>3.0.CO;2-X
. [all data]
Rajeswara Rao, 2001
Rajeswara Rao, B.R.,
Biomass and essential oil yields of rainfed palmarosa (Cymbopogon martinii (Roxb.) Wats. var. motia Burk.) supplied with different levels of organic manure and fertilizer nitrogen in semi-arid tropical climate,
Ind. Crops Prod., 2001, 14, 3, 171-178, https://doi.org/10.1016/S0926-6690(01)00081-4
. [all data]
Adams, 2000
Adams, R.P.,
Systematics of Juniperus section Juniperus based on leaf essential oils and random amplified polymorphic DNAs (RAPDs),
Biochem. Syst. Ecol., 2000, 28, 6, 515-528, https://doi.org/10.1016/S0305-1978(99)00089-7
. [all data]
Rao, Kaul, et al., 2000
Rao, B.R.R.; Kaul, P.N.; Mallavarapu, G.R.; Ramesh, S.,
First observation of little leaf disease and its impact on the yield and composition of the essential oil of rose-scented geranium (Pelargonium sp.),
Flavour Fragr. J., 2000, 15, 3, 137-140, https://doi.org/10.1002/1099-1026(200005/06)15:3<137::AID-FFJ880>3.0.CO;2-A
. [all data]
Rao, Rout, et al., 2000
Rao, Y.R.; Rout, P.K.; Jena, K.S.; Sahu, S.B.,
Composition of essential oil of citronella (Cymbopogon winterianus jowitt) grown in coastal Orissa,
Fafai J., 2000, 2, 4, 29-31. [all data]
Rao, Sastry, et al., 2000
Rao, B.R.R.; Sastry, K.P.; Saleem, S.M.; Rao, E.V.S.P.; Syamasundar, K.V.; Ramesh, S.,
Volatile flower oils of three genotypes of rose-scented geranium (Pelargonium sp.),
Flavour Fragr. J., 2000, 15, 2, 105-107, https://doi.org/10.1002/(SICI)1099-1026(200003/04)15:2<105::AID-FFJ875>3.0.CO;2-G
. [all data]
Adams, 1999
Adams, R.P.,
Systematics of multi-seeded eastern hemisphere Juniperus based on leaf essential oils and RAPD DNA fingerprinting,
Biochem. Syst. Ecol., 1999, 27, 7, 709-725, https://doi.org/10.1016/S0305-1978(99)00016-2
. [all data]
Sajjadi and Ghassemi, 1999
Sajjadi, S.E.; Ghassemi, N.,
Volatile constituents of Nepeta glomerulosa Boiss. subsp. carmanica,
Flavour Fragr. J., 1999, 14, 5, 265-267, https://doi.org/10.1002/(SICI)1099-1026(199909/10)14:5<265::AID-FFJ822>3.0.CO;2-A
. [all data]
Vera and Chane-Ming, 1999
Vera, R.R.; Chane-Ming, J.,
Chemical composition of the essential oil of marjoram (Origanum majorana L.) from Reunion Island,
Food Chem., 1999, 66, 2, 143-145, https://doi.org/10.1016/S0308-8146(98)00018-1
. [all data]
Bylaite, Venskutonis, et al., 1998
Bylaite, E.; Venskutonis, R.P.; Roozen, J.P.,
Influence of harvesting time on the composition of volatile components in different anatomical parts of lovage (Levisticum officinale Koch.),
J. Agric. Food Chem., 1998, 46, 9, 3735-3740, https://doi.org/10.1021/jf9800559
. [all data]
Kaul and Vats, 1998
Kaul, V.K.; Vats, S.K.,
Essential oil composition of Bothriochloa pertusa and phyletic relationship in aromatic grasses,
Biochem. Syst. Ecol., 1998, 26, 3, 347-356, https://doi.org/10.1016/S0305-1978(97)00103-8
. [all data]
Kulkarni, Mallavarapu, et al., 1998
Kulkarni, R.N.; Mallavarapu, G.R.; Baskaran, K.; Ramesch, S.; Kumar, S.,
Composition of the essential oils of two isomenthone-rich variants of geranium (Pelargonium sp.),
Flavour Fragr. J., 1998, 13, 6, 389-392, https://doi.org/10.1002/(SICI)1099-1026(199811/12)13:6<389::AID-FFJ757>3.0.CO;2-2
. [all data]
Mallavarapu, Rao, et al., 1998
Mallavarapu, G.R.; Rao, B.R.R.; Kaul, P.N.; Ramesh, S.; Bhattacharya, A.K.,
Volatile constituents of the essential oils of the seeds and the herb of palmarosa (Cymbopogon martinii (Roxb.) Wats. var. motia Burk.),
Flavour Fragr. J., 1998, 13, 3, 167-169, https://doi.org/10.1002/(SICI)1099-1026(199805/06)13:3<167::AID-FFJ719>3.0.CO;2-B
. [all data]
Afsharypuor, Asgary, et al., 1996
Afsharypuor, S.; Asgary, S.; Lockwood, G.B.,
Volatile constituents of Achillea millefolium L. ssp. millefolium from Iran,
Flavour Fragr. J., 1996, 11, 5, 265-267, https://doi.org/10.1002/(SICI)1099-1026(199609)11:5<265::AID-FFJ592>3.0.CO;2-F
. [all data]
Jantan, Ahmad, et al., 1996
Jantan, I.; Ahmad, A.S.; Ahmad, A.R.; Ali, N.A.M.; Ayop, N.,
Chemical composition of some citrus oils from Malaysia,
J. Essent. Oil Res., 1996, 8, 6, 627-632, https://doi.org/10.1080/10412905.1996.9701030
. [all data]
Jantan, Ali, et al., 1995
Jantan, I.; Ali, N.A.M.; Ahmad, A.S.; Ahmad, A.R.,
Constituents of the essential oil of Leptospermum javanicum blume from peninsular Malaysia,
Flavour Fragr. J., 1995, 10, 4, 255-258, https://doi.org/10.1002/ffj.2730100406
. [all data]
Loayza, Abujder, et al., 1995
Loayza, I.; Abujder, D.; Aranda, R.; Jakupovic, J.; Collin, G.; Deslauriers, H.; Jean, F.-I.,
Essential oils of Baccharis salicifolia, B. latifolia and B. dracunculifolia,
Phytochemistry, 1995, 38, 2, 381-389, https://doi.org/10.1016/0031-9422(94)00628-7
. [all data]
Gaydou, Randriamiharisoa, et al., 1986
Gaydou, E.M.; Randriamiharisoa, R.; Bianchini, J.-P.,
Composition of the essential oil of ylang-ylang (Canaga odorata Hook Fil. et Thomson forma genuina) from Madagascar,
J. Agric. Food Chem., 1986, 34, 3, 481-487, https://doi.org/10.1021/jf00069a028
. [all data]
de Marchese, de Heluani, et al., 2007
de Marchese, M.J.A.; de Heluani, C.S.; Catalán, C.A.N.; Griffin, C.A.; Vaughn, J.B., Jr.; Herz, W.,
Incisol, an alcohol with a novel sesquiterpene skeleton from Xenophyllum incisum,
Biochem. Syst. Ecol., 2007, 35, 3, 169-175, https://doi.org/10.1016/j.bse.2006.10.006
. [all data]
Riu-Aumatell, Castellari, et al., 2004
Riu-Aumatell, M.; Castellari, M.; López-Tamames, E.; Galassi, S.; Buxaderas, S.,
Characterisation of volatile compounds of fruit juices and nectars by HS/SPME and GC/MS,
Food Chem., 2004, 87, 4, 627-637, https://doi.org/10.1016/j.foodchem.2003.12.033
. [all data]
Sibanda, Chigwada, et al., 2004
Sibanda, S.; Chigwada, G.; Poole, M.; Gwebu, E.T.; Noletto, J.A.; Schmidt, J.M.; Rea, A.I.; Setzer, W.N.,
Composition and bioactivity of the leaf essential oil of Heteropyxis dehniae from Zimbabwe,
J. Ethnopharmacol., 2004, 92, 1, 107-111, https://doi.org/10.1016/j.jep.2004.02.010
. [all data]
Daferera, Ziogas, et al., 2003
Daferera, D.J.; Ziogas, B.N.; Polissiou, M.G.,
The effectiveness of plant essential oils on the growth of Botrytis cinerea, Fusarium sp. and Clavibacter michiganensis subsp. michiganensis,
Crop Prot., 2003, 22, 1, 39-44, retrieved from http://www.elsevier.com/gej-ng/10/25/40/84/25/31/article.pdf, https://doi.org/10.1016/S0261-2194(02)00095-9
. [all data]
Khan, Srivastava, et al., 2003
Khan, M.; Srivastava, S.K.; Jain, N.; Syamasundar, K.V.; Yadav, A.K.,
Chemical composition of fruit and stem essential oils of Lantana camara from northern India,
Flavour Fragr. J., 2003, 18, 5, 376-379, https://doi.org/10.1002/ffj.1197
. [all data]
Raina, Srivastava, et al., 2003
Raina, V.K.; Srivastava, S.K.; Aggarwal, K.K.; Syamasunder, K.V.; Khanuja, S.P.S.,
Essential oil composition of Cymbopogon martinii from different places in India,
Flavour Fragr. J., 2003, 18, 4, 312-315, https://doi.org/10.1002/ffj.1222
. [all data]
Rao, Kaul, et al., 2003
Rao, B.R.R.; Kaul, P.N.; Syamasundar, K.V.; Ramesh, S.,
Comparative composition of decanted and recovered essential oils of Eucalyptus citriodora Hook,
Flavour Fragr. J., 2003, 18, 2, 133-135, https://doi.org/10.1002/ffj.1157
. [all data]
Shellie and Marriott, 2003
Shellie, R.A.; Marriott, P.J.,
Comprehensive two-dimensional gas chromatography-mass spectrometry analysis of Pelargonium graveolens essential oil using rapid scanning quadrupole mass spectrometry,
Analyst, 2003, 128, 7, 879-883, https://doi.org/10.1039/b304371a
. [all data]
Borse, Jagan Mohan Rao, et al., 2002
Borse, B.B.; Jagan Mohan Rao, L.; Nagalakshmi, S.; Krishnamurthy, N.,
Fingerprint of black teas from India: identification of the regio-specific characteristics,
Food Chem., 2002, 79, 4, 419-424, https://doi.org/10.1016/S0308-8146(02)00191-7
. [all data]
Khan, Srivastava, et al., 2002
Khan, M.; Srivastava, S.K.; Syamasundar, K.V.; Singh, M.; Naqvi, A.A.,
Chemical composition of leaf and flower essential oil of Lantana camara from India,
Flavour Fragr. J., 2002, 17, 1, 75-77, https://doi.org/10.1002/ffj.1047
. [all data]
Adams, 1998
Adams, R.P.,
The essential oils and chemotaxonomy of Juniperus sect. Juniperus,
Biochem. Syst. Ecol., 1998, 26, 6, 637-645, https://doi.org/10.1016/S0305-1978(98)00020-9
. [all data]
Tudor, Moldovan, et al., 1999
Tudor, E.; Moldovan, D.; Zârna, N.,
Temperature dependence of the retention index for perfumery compounds on two carbowax-20M glass capillary columns with different film thickness. 2,
Rev. Roum. Chim., 1999, 44, 7, 665-675. [all data]
ter Heide, 1968
ter Heide, R.,
Studies on terpenes. II. Characterization of monoterpene esters by gas and thin-layer chromatography,
Z. Anal. Chem., 1968, 236, 215-227. [all data]
Umano, Hagi, et al., 1994
Umano, K.; Hagi, Y.; Tamura, T.; Shoji, A.; Shibamoto, T.,
Identification of volatile compounds isolated from round kumquat (Fortunella japonica Swingle),
J. Agric. Food Chem., 1994, 42, 9, 1888-1890, https://doi.org/10.1021/jf00045a011
. [all data]
Randriamiharisoa and Gaydou, 1987
Randriamiharisoa, R.P.; Gaydou, E.M.,
Composition of Palmarosa (Cymbopogon martinii) essential oil from Madagascar,
J. Agric. Food Chem., 1987, 35, 1, 62-66, https://doi.org/10.1021/jf00073a015
. [all data]
Belsito E.L., Carbone C., et al., 2007
Belsito E.L.; Carbone C.; Di Gioia M.L.; Leggio A.; Liguoiri A.; Perri F.; Siciliano C.; Viscomi M.C.,
Comparison of the volatile constituents in cold-pressed bergamot oil and a volatile oil isolated by vacuum distillation,
J. Agric. Food Chem., 2007, 55, 19, 7847-7851, https://doi.org/10.1021/jf070997q
. [all data]
Benzo, Gilardoni, et al., 2007
Benzo, M.; Gilardoni, G.; Gandini, C.; Caccialanza, G.; Finzi, P.V.; Vidari, G.; Abdo, S.; Layedra, P.,
Determination of the threshold odor concentration of main odorants in essential oils using gas chromatography-olfactometry incremental dilution technique,
J. Chromatogr. A, 2007, 1150, 1-2, 131-135, https://doi.org/10.1016/j.chroma.2007.02.031
. [all data]
Dehghan, Solaimanian, et al., 2007
Dehghan, G.; Solaimanian, R.; Shahverdi, A.R.; Amin, G.; Abdollahi, M.; Shafiee, A.,
Chemical composition and antimicrobial activity of essential oil of Ferula szovitsiana D.C.,
Flavour Fragr. J., 2007, 22, 3, 224-227, https://doi.org/10.1002/ffj.1789
. [all data]
Duquesnoy, Castola, et al., 2007
Duquesnoy, E.; Castola, V.; Casanova, J.,
Composition and chemical variability of the twig oil of Abies alba Miller from Corsica,
Flavour Fragr. J., 2007, 22, 4, 293-299, https://doi.org/10.1002/ffj.1796
. [all data]
Flamini, Tebano, et al., 2007
Flamini, G.; Tebano, M.; Cioni, P.L.,
Volatiles emission patterns of different plant organs and pollen of Citrus limon,
Anal. Chim. Acta., 2007, 589, 1, 120-124, https://doi.org/10.1016/j.aca.2007.02.053
. [all data]
Paolini J., Costa J., et al., 2007
Paolini J.; Costa J.; Bernardini A.F.,
Analysis of the essential oil from the roots of Eupatorium cannabinum subsp corsicum (L.) by GC, GC-MS and C-13-NMR,
Phytochem. Anal., 2007, 18, 3, 235-244, https://doi.org/10.1002/pca.977
. [all data]
Silva, Barbosa, et al., 2007
Silva, C.J.; Barbosa, L.C.A.; Maltha, C.R.A.; Pinheiro, A.L.; Ismail, F.M.D.,
Comparative study of the essential oils of seven Melaleuca (Myrtaceae) species grown in Brazil,
Flavour Fragr. J., 2007, 22, 6, 474-478, https://doi.org/10.1002/ffj.1823
. [all data]
Dob, Dahmane, et al., 2006
Dob, T.; Dahmane, D.; Agli, M.; Chelghoum, C.,
Essential oil composition of Lavandula stoechas from Algeria,
Pharm. Biol., 2006, 44, 1, 60-64, https://doi.org/10.1080/13880200500496421
. [all data]
Gonny, Cavaleiro, et al., 2006
Gonny, M.; Cavaleiro, C.; Salgueiro, L.; Casanova, J.,
Analysis of Juniperus communis subsp. alpina needle, berry, wood and root oils by combination of GC, GC/MS and 13C-NMR,
Flavour Fragr. J., 2006, 21, 1, 99-106, https://doi.org/10.1002/ffj.1527
. [all data]
Pinto, Pina-Vaz, et al., 2006
Pinto, E.; Pina-Vaz, C.; Salgueiro, L.; Goncalves, M.J.; Costa-de-Oliveira, S.; Cavaleiro, C.; Palmeira, A.; Rodrigues, A.; Martinez-de-Oliveira, J.,
Antifuncal activity of the essential oil Thymus pulegioides on Candida, Aspergillus and dermatophyte species,
Journal of Medical Microbiology, 2006, 55, 10, 1367-1373, https://doi.org/10.1099/jmm.0.46443-0
. [all data]
Radulovic, Mananjarasoa, et al., 2006
Radulovic, N.; Mananjarasoa, E.; Harinantenaina, L.; Yoshinori, A.,
Essential oil composition of four Croton species from Madagascar and their chemotaxonomy,
Biochem. Syst. Ecol., 2006, 34, 8, 648-653, https://doi.org/10.1016/j.bse.2006.02.005
. [all data]
Salgueiro L.R., Pinto E., et al., 2006
Salgueiro L.R.; Pinto E.; Goncalves M.J.; Costa I.; Palmeira A.; Cavaleiro C.; Pina-Vaz C.; Rodrigues A.G.; Martinez-De-Oliveira J.,
Antifungal activity of the essential oil of Thymus capitellatus against Candida, Aspergillus and dermatophyte strains,
Flavour Fragr. J., 2006, 21, 5, 749-753, https://doi.org/10.1002/ffj.1610
. [all data]
Saroglou, Dorizas, et al., 2006
Saroglou, V.; Dorizas, N.; Kypriotakis, Z.; Skaltsa, H.D.,
Analysis of the essential oil composition of eight Anthemis species from Greece,
J. Chromatogr. A, 2006, 1104, 1-2, 313-322, https://doi.org/10.1016/j.chroma.2005.11.087
. [all data]
Su, Ho, et al., 2006
Su, Y.C.; Ho, C.L.; Wang, E.I.C.,
Analysis of leaf essential oils from the indigenous five conifers of Taiwan,
Flavour Fragr. J., 2006, 21, 3, 447-452, https://doi.org/10.1002/ffj.1685
. [all data]
Su, Ho, et al., 2006, 2
Su, Y.-C.; Ho, C.-L.; Wang, E.I.-C.; Chang, S.-T.,
Antifungal activities and chemical compositions of essential oils from leaves of four eucalypts,
Taiwan J. For. Sci., 2006, 21, 1, 49-61. [all data]
Vujisic L., Vuckovic I., et al., 2006
Vujisic L.; Vuckovic I.; Tesevic V.; Dokovic D.; Ristic M.S.; Janackovic P.; Milosavljevic S.,
Comparative examination of the essential oils of Anthemis ruthenica and A-arvensis wild-growing in Serbia,
Flavour Fragr. J., 2006, 21, 3, 458-461, https://doi.org/10.1002/ffj.1681
. [all data]
Boskovic, Radulovic, et al., 2005
Boskovic, Z.; Radulovic, N.; Stojanovic, G.,
Essential oil composition of four Achillea species from the balkans and its chemotaxonomic significance,
Chem. Nat. Compd. (Engl. Transl.), 2005, 41, 6, 674-678, https://doi.org/10.1007/s10600-006-0009-6
. [all data]
Cozzani, Muselli, et al., 2005
Cozzani, S.; Muselli, A.; Desjobert, J.-M.; Bernardini, A.-F.; Tomi, F.; Casanova, J.,
Chemical composition of essential oil of Teucrium polium subsp. capitatum (L.) from Corsica,
Flavour Fragr. J., 2005, 20, 4, 436-441, https://doi.org/10.1002/ffj.1463
. [all data]
Dob, Berramdane, et al., 2005
Dob, T.; Berramdane, T.; Dahmane, D.; Chelghoum, C.,
Chemical composition of the needles oil of Pinus canariensis from Algeria,
Chem. Nat. Compd. (Engl. Transl.), 2005, 41, 2, 165-167, https://doi.org/10.1007/s10600-005-0103-1
. [all data]
Dob T., Berramdane T., et al., 2005
Dob T.; Berramdane T.; Chelghoum C.,
Analysis of essential oil from the needles of Pinus pinaster growing in Algeria,
Chem. Nat. Compd. (Engl. Transl.), 2005, 41, 5, 545-548, https://doi.org/10.1007/s10600-005-0202-z
. [all data]
Dob, Dahmane, et al., 2005
Dob, T.; Dahmane, D.; Berramdane, T.; Chelghoum, C.,
Chemical composition of the essential oil of Artemisia campestris L. from Algeria,
Pharm. Biol., 2005, 43, 6, 512-514, https://doi.org/10.1080/13880200500220664
. [all data]
Dugo, Mondello, et al., 2005
Dugo, P.; Mondello, L.; Favoino, O.; Cicero, L.; Rodriguez Zenteno, N.A.; Dugo, G.,
Characterization of cold-pressed Mexican dancy tangerine oils,
Flavour Fragr. J., 2005, 20, 1, 60-66, https://doi.org/10.1002/ffj.1367
. [all data]
Fanciullino, Gancel, et al., 2005
Fanciullino, A.-L.; Gancel, A.-L.; Froelicher, Y.; Luro, F.; Ollitrault, P.; Brillouet, J.-M.,
Effects of Nucleo-cytoplasmic Interactions on Leaf Volatile Compounds from Citrus Somatic Diploid Hybrids,
J. Agric. Food Chem., 2005, 53, 11, 4517-4523, https://doi.org/10.1021/jf0502855
. [all data]
Ferrari, Tomi, et al., 2005
Ferrari, B.; Tomi, F.; Casanova, J.,
Composition and chemical variability of Ferula communis essential oil from Corsica,
Flavour Fragr. J., 2005, 20, 2, 180-185, https://doi.org/10.1002/ffj.1405
. [all data]
Gancel, Ollitrault, et al., 2005
Gancel, A.-L.; Ollitrault, P.; Froelicher, Y.; Tomi, F.; Jacquemond, C.; Luro, F.; Brillouet, J.-M.,
Leaf volatile compounds of six citrus somatic allotetraploid hybrids originating from various combinations of lime, lemon, citron, sweet orange, and grapefruit,
J. Agric. Food Chem., 2005, 53, 6, 2224-2230, https://doi.org/10.1021/jf048315b
. [all data]
Idzojtic, Kajba, et al., 2005
Idzojtic, M.; Kajba, D.; Franjic, J.,
Differentiation of F1 hybrids P. nigra J. F. Arnold × P. sylvestris L., P. nigra J. F. Arnold × P. densiflora Siebold et Zucc., P. nigra J. F. Arnold × P. thunbergiana Franco and their parental species by needle volatile composition,
Biochem. Syst. Ecol., 2005, 33, 4, 427-439, https://doi.org/10.1016/j.bse.2004.10.008
. [all data]
Paolini, Costa, et al., 2005
Paolini, J.; Costa, J.; Bernardini, A.,
Analysis of the essential oil from aerial parts of Eupatorium cannabinum subsp. corsicum (L.) by gas chromatography with electron impact and chemical ionization mass spectrometry,
J. Chromatogr. A, 2005, 1076, 1-2, 170-178, https://doi.org/10.1016/j.chroma.2005.03.131
. [all data]
Pino, Mesa, et al., 2005
Pino, J.A.; Mesa, J.; Muñoz, Y.; Martí, M.P.; Marbot, R.,
Volatile components from mango (Mangifera indica L.) cultivars,
J. Agric. Food Chem., 2005, 53, 6, 2213-2223, https://doi.org/10.1021/jf0402633
. [all data]
Smadja, Rondeau, et al., 2005
Smadja, J.; Rondeau, P.; Sing, A.S.C.,
Volatile constituents of five Citrus Petitgrain essential oils from Reunion,
Flavour Fragr. J., 2005, 20, 4, 399-402, https://doi.org/10.1002/ffj.1438
. [all data]
Verzera, Trozzi, et al., 2005
Verzera, A.; Trozzi, A.; Zappala, M.; Condurso, C.; Cotroneo, A.,
Essential Oil Composition of Citrus meyerii Y. Tan. and Citrus medica L. cv. Diamante and Their Lemon Hybrids,
J. Agric. Food Chem., 2005, 53, 12, 4890-4894, https://doi.org/10.1021/jf047879c
. [all data]
Bertoli, Pistelli, et al., 2004
Bertoli, A.; Pistelli, L.; Morelli, I.; Fraternale, D.; Giamperi, L.; Ricci, D.,
Volatile constituents of different parts (roots, stems and leaves) of Smyrnium olusatrum L.,
Flavour Fragr. J., 2004, 19, 6, 522-525, https://doi.org/10.1002/ffj.1382
. [all data]
Chorianopoulos, Kalpoutzakis, et al., 2004
Chorianopoulos, N.; Kalpoutzakis, E.; Aligiannis, N.; Mitaku, S.; Nychas, G.-J.; Haroutounian, S.A.,
Essential oils of Satureja, Origanum, and Thymus species: chemical composition and antibacterial activities against foodborne pathogens,
J. Agric. Food Chem., 2004, 52, 26, 8261-8267, https://doi.org/10.1021/jf049113i
. [all data]
Dugo, Mondello, et al., 2004
Dugo, P.; Mondello, L.; Zappia, G.; Bonaccorsi, I.; Cotroneo, A.; Russo, M.T.,
The composition of the volatile fraction and the enantiomeric distribution of five volatile components of faustrime oil (Monocitrus australatica x Fortunella sp. x Citrus aurantifolia),
J. Essent. Oil Res., 2004, 16, 4, 328-333, https://doi.org/10.1080/10412905.2004.9698734
. [all data]
Javidnia, Miri, et al., 2004
Javidnia, K.; Miri, R.; Sadeghpour, H.,
Composition of the volatile oil of Achillea wilhelmsii C. Koch from Iran,
DARU, 2004, 12, 2, 63-66, retrieved from http://www1.tums.ac.ir/daru/. [all data]
Karioti, Hadjipavlou-Litina, et al., 2004
Karioti, A.; Hadjipavlou-Litina, D.; Mensah, M.L.K.; Fleischer, T.C.; Skaltsa, H.,
Composition and antioxidant activity of the essential oils of Xylopia aethiopica (Dun) A. Rich. (Annonaceae) leaves, stem bark, root bark, and fresh and dried fruits, growing in Ghana,
J. Agric. Food Chem., 2004, 52, 26, 8094-8098, https://doi.org/10.1021/jf040150j
. [all data]
Mardarowicz, Wianowska, et al., 2004
Mardarowicz, M.; Wianowska, D.; Dawidowicz, A.L.; Sawicki, R.,
The influence of sample treatment on SPME extracts from conifers. I. Comparison of terpene composition in Engelmann Spruce (Picea engelmanii) using hydrodistillation, SPME and PLE,
Annales Universitatis Mariae Curie-Sklodowska Lublin - Polonia, 2004, 59, 3, 25-42. [all data]
Moldão-Martins, Beirão-da-Costa, et al., 2004
Moldão-Martins, M.; Beirão-da-Costa, S.; Neves, C.; Cavaleiro, C.; Salgueiro, L.; Beirão-da-Costa, M.L.,
Olive oil flavoured by the essential oils of Mentha × piperita and Thymus mastichina L.,
Food Qual. Pref., 2004, 15, 5, 447-452, https://doi.org/10.1016/j.foodqual.2003.08.001
. [all data]
Ngassoum, Ousmaila, et al., 2004
Ngassoum, M.B.; Ousmaila, H.; Ngamo, L.T.; Maponmetsem, P.M.; Jirovetz, L.; Buchbauer, G.,
Aroma compounds of essential oils of two varieties of the spice plant Ocimum canum Sims from northern Cameroon,
J. Food Comp. Anal., 2004, 17, 2, 197-204, https://doi.org/10.1016/j.jfca.2003.08.002
. [all data]
Raina, Kumar, et al., 2004
Raina, V.K.; Kumar, A.; Srivastava, S.K.; Syamsundar, K.V.; Kahol, A.P.,
Essential oil composition of 'kewda' (Pandanus odoratissimus) from India,
Flavour Fragr. J., 2004, 19, 5, 434-436, https://doi.org/10.1002/ffj.1331
. [all data]
Sartoratto, Machado, et al., 2004
Sartoratto, A.; Machado, A.L.M.; Delarmelina, C.; Figueira, G.M.; Duarte, M.C.T.; Rehder, V.L.G.,
Composition and antimicrobial activity of essential oils from aromatic plants used in Brazil,
Braz. J. Microbiol., 2004, 35, 4, 275-280, https://doi.org/10.1590/S1517-83822004000300001
. [all data]
Tam, Thuam, et al., 2004
Tam, N.T.; Thuam, D.T.; Bighelli, A.; Castola, V.; Muselli, A.; Richomme, P.; Casanova, J.,
Baeckea frutescens leaf oil from Vietnam: composition and chemical variability,
Flavour Fragr. J., 2004, 19, 3, 217-220, https://doi.org/10.1002/ffj.1281
. [all data]
Yoo, Kim, et al., 2004
Yoo, Z.-W.; Kim, N.-S.; Lee, D.-S.,
Comparative analyses of the flavors from Hallabong (Citrus sphaerocarpa) with lemon, orange, and grapefruit by SPTE and HS-SPME combined with GC-MS,
Bull. Korean Chem. Soc., 2004, 25, 2, 271-279, https://doi.org/10.5012/bkcs.2004.25.2.271
. [all data]
Yu, Kim, et al., 2004
Yu, E.J.; Kim, T.H.; Kim, K.H.; Lee, H.J.,
Aroma-active compounds of Pinus densiflora (red pine) needles,
Flavour Fragr. J., 2004, 19, 6, 532-537, https://doi.org/10.1002/ffj.1337
. [all data]
Yu, Kim, et al., 2004, 2
Yu, E.J.; Kim, T.H.; Kim, K.H.; Lee, H.J.,
Characterization of aroma-active compounds of Abies nephrolepis (Khingan fir) needles using aroma extract dilution analysis,
Flavour Fragr. J., 2004, 19, 1, 74-79, https://doi.org/10.1002/ffj.1314
. [all data]
Boyom, Assembe, et al., 2003
Boyom, F.F.; Assembe, E.Z.; Zollo, P.H.A.; Agnaniet, H.; Menut, C.; Bessière, J.M.,
Aromatic plants of tropical central Africa. Part XLII. Volatile components from Antidesma laciniatum Muell. Arg. Var. laciniatum growing in Cameroon,
Flavour Fragr. J., 2003, 18, 5, 451-453, https://doi.org/10.1002/ffj.1251
. [all data]
Cavaleiro, Salgueiro, et al., 2003
Cavaleiro, C.; Salgueiro, L.R.; da Cunha, A.P.; Figueiredo, A.C.; Barroso, J.G.; Bighelli, A.; Casanova, J.,
Composition and variability of the essential oils of the leaves and berries from Juniperus navicularis,
Biochem. Syst. Ecol., 2003, 31, 2, 193-201, https://doi.org/10.1016/S0305-1978(02)00080-7
. [all data]
Chisholm, Wilson, et al., 2003
Chisholm, M.G.; Wilson, M.A.; Gaskey, G.M.,
Characterization of aroma volatiles in key lime essential oils (Cirtrus aurantifolia Swingle),
Flavour Fragr. J., 2003, 18, 2, 106-115, https://doi.org/10.1002/ffj.1172
. [all data]
de Feo, Urrunaga Soria, et al., 2003
de Feo, V.; Urrunaga Soria, E.; Urrunaga Soria, R.; Senatore, F.,
Chemical composition of essential oils of senecio nutans Sch.-Bip. (Asteraceae),
Flavour Fragr. J., 2003, 18, 3, 234-236, https://doi.org/10.1002/ffj.1204
. [all data]
Gancel, Ollitrault, et al., 2003
Gancel, A.-L.; Ollitrault, P.; Froelicher, Y.; Tomi, F.; Jacquemond, C.; Luro, F.; Brillouet, J.-M.,
Leaf volatile compounds of seven citrus somatic tetraploid hybrids sharing willow leaf mandarin (Citrus deliciosa Ten.) as their common parent,
J. Agric. Food Chem., 2003, 51, 20, 6006-6013, https://doi.org/10.1021/jf0345090
. [all data]
bin Jantan, Yassin, et al., 2003
bin Jantan, I.; Yassin, M.S.M.; Chin, C.B.; Chen, L.L.; Sim. N.L.,
Antifungal activity of the essential oils of nine Zingiberaceae species,
Pharm. Biol., 2003, 41, 5, 392-397, https://doi.org/10.1076/phbi.41.5.392.15941
. [all data]
Javidnia, Miri, et al., 2003
Javidnia, K.; Miri, R.; Azarpira, A.; Tabaei, S.M.H.,
Composition of the essential oil of Stachys setifera C.A. Mey ssp. iranica growing in Iran,
Flavour Fragr. J., 2003, 18, 4, 299-300, https://doi.org/10.1002/ffj.1165
. [all data]
Macchioni, Cioni, et al., 2003
Macchioni, F.; Cioni, P.L.; Flamini, G.; Morelli, I.; Maccioni, S.; Ansaldi, M.,
Chemical composition of essential oils from needles, branches and cones of Pinus pinea, P. halepensis, P. pinaster and P. nigra from central Italy,
Flavour Fragr. J., 2003, 18, 2, 139-143, https://doi.org/10.1002/ffj.1178
. [all data]
Verzera, Trozzi, et al., 2003
Verzera, A.; Trozzi, A.; Gazea, F.; Cicciarelloi, G.; Cotroneo, A.,
Effects of rootstock on the composition of bergamot (Citrus bergamia Risso et Poiteau) essential oil,
J. Agric. Food Chem., 2003, 51, 1, 206-210, https://doi.org/10.1021/jf0206872
. [all data]
Choi, Kim. M.-S.L., et al., 2002
Choi, H.-S.; Kim. M.-S.L.; Sawamura, M.,
Constituents of the essential oil of cnidium officinale Makino, a Korean medicinal plant,
Flavour Fragr. J., 2002, 17, 1, 49-53, https://doi.org/10.1002/ffj.1038
. [all data]
Javidnia, Miri, et al., 2002
Javidnia, K.; Miri, R.; Kamalinejad, M.; Nasiri, A.,
Composition of the essential oil of Salvia mirzayanii Rech. f. Esfand from Iran,
Flavour Fragr. J., 2002, 17, 6, 465-467, https://doi.org/10.1002/ffj.1128
. [all data]
Lota, de Rocca Serra, et al., 2002
Lota, M.-L.; de Rocca Serra, D.; Tomi, F.; Jacquemond, C.; Casanova, J.,
Volatile components of peel and leaf oils of lemon and lime species,
J. Agric. Food Chem., 2002, 50, 4, 796-805, https://doi.org/10.1021/jf010924l
. [all data]
Mondello, Zappia, et al., 2002
Mondello, L.; Zappia, G.; Cotroneo, A.; Bonaccorsi, I.; Chowdhury, J.U.; Yusuf, M.; Dugo, G.,
Studies on the essential oil-bearing plants of Bangladesh. Part VIII. Composition of some Ocimum oils O. basilicum L. var. purpurascens; O. sanctum L. green; O. sanctum L. purple; O. americanum L., citral type; O. americanum L., camphor type,
Flavour Fragr. J., 2002, 17, 5, 335-340, https://doi.org/10.1002/ffj.1108
. [all data]
Nath, Sarma, et al., 2002
Nath, S.C.; Sarma, K.K.; Vajezikova, I.; Leclercq, P.A.,
Comparison of volatile inflorescence oils and taxonomy of certain Cymbopogon taxa described as Cymbopogon flexuosus (Nees ex Steud.) Wats.,
Biochem. Syst. Ecol., 2002, 30, 2, 151-162, https://doi.org/10.1016/S0305-1978(01)00066-7
. [all data]
Pino, Marbot, et al., 2002
Pino, J.A.; Marbot, R.; Quert, R.; García, H.,
Study of essential oils of Eucalyptus resinifera Smith, E. tereticornis Smith and Corymbia maculata (Hook.) K.D. Hill L.A.S. Johnson, grown in Cuba,
Flavour Fragr. J., 2002, 17, 1, 1-4, https://doi.org/10.1002/ffj.1026
. [all data]
Pino, Marbot, et al., 2002, 2
Pino, J.A.; Marbot, R.; Bello, A.,
Volatile compounds of Psidium salutare (H.B.K.) Berg. fruit,
J. Agric. Food Chem., 2002, 50, 18, 5146-5148, https://doi.org/10.1021/jf0116303
. [all data]
Pintore, Usai, et al., 2002
Pintore, G.; Usai, M.; Bradesi, P.; Juliano, C.; Boatto, G.; Tomi, F.; Chessa, M.; Cerri, R.; Casanova, J.,
Chemical composition and antimicrobial activity of Rosmarinus officinalis L. oils from Sardinia and Corsica,
Flavour Fragr. J., 2002, 17, 1, 15-19, https://doi.org/10.1002/ffj.1022
. [all data]
Pitarokili, Couladis, et al., 2002
Pitarokili, D.; Couladis, M.; Petsikos-Panayotarou, N.; Tzakou, O.,
Composition and antifungal activity on soil-borne pathogens of the essential oil of Salvia sclarea from Greece,
J. Agric. Food Chem., 2002, 50, 23, 6688-6691, https://doi.org/10.1021/jf020422n
. [all data]
Shellie, Mondello, et al., 2002
Shellie, R.; Mondello, L.; Marriott, P.; Dugo, G.,
Characterisation of lavender essential oils by using gas chromatography-mass spectrometry with correlation of linear retention indices and comparison with comprehensive two-dimensional gas chromatography,
J. Chromatogr. A, 2002, 970, 1-2, 225-234, https://doi.org/10.1016/S0021-9673(02)00653-2
. [all data]
Aligiannis, Kalpoutzakis, et al., 2001
Aligiannis, N.; Kalpoutzakis, E.; Mitaku, S.; Chinou, I.B.,
Composition and antimicrobial activity of the essential oils of two Origanum species,
J. Agric. Food Chem., 2001, 49, 9, 4168-4170, https://doi.org/10.1021/jf001494m
. [all data]
Couladis, Tsortanidou, et al., 2001
Couladis, M.; Tsortanidou, V.; Francisco-Ortega, J.; Santos-Guerra, A.; Harvala, C.,
Composition of the essential oils of Argyranthemum species growing in the Canary Islands,
Flavour Fragr. J., 2001, 16, 2, 103-106, https://doi.org/10.1002/ffj.954
. [all data]
Hudaib, Grazia Bellardi, et al., 2001
Hudaib, M.; Grazia Bellardi, M.; Rubies-Autonell, C.; Fiori, J.; Cavrini, V.,
Chromatographic (GC-MS, HPLC) and virological evaluations of Salvia sclarea infected by BBWV-I,
Farmaco, 2001, 56, 3, 219-227, https://doi.org/10.1016/S0014-827X(01)01038-2
. [all data]
Lota, Serra, et al., 2001
Lota, M.-L.; Serra, D.R.; Jacquemond, C.; Tomi, F.; Casanova, J.,
Chemical variability of peel and leaf essential oils of sour orange,
Flavour Fragr. J., 2001, 16, 2, 89-96, https://doi.org/10.1002/1099-1026(200103/04)16:2<89::AID-FFJ950>3.0.CO;2-D
. [all data]
Rezzi, Bighelli, et al., 2001
Rezzi, S.; Bighelli, A.; Mouillot, D.; Casanova, J.,
Composition and chemical variability of the needle essential oil of Pinus nigra subsp. laricio from corsica,
Flavour Fragr. J., 2001, 16, 5, 379-383, https://doi.org/10.1002/ffj.1018
. [all data]
Skaltsa, Mavrommati, et al., 2001
Skaltsa, H.D.; Mavrommati, A.; Constantinidis, T.,
A chemotaxonomic investigation of volatile constituents in Stachys subsect. Swainsonianeae (Labiatae),
Phytochemistry, 2001, 57, 2, 235-244, https://doi.org/10.1016/S0031-9422(01)00003-6
. [all data]
Alonzo, Bosco, et al., 2000
Alonzo, G.; Bosco, S.F.D.; Palazzolo, E.; Saiano, F.; Tusa, N.,
Citrus somatic hybrid leaf essential oil,
Flavour Fragr. J., 2000, 15, 4, 258-262, https://doi.org/10.1002/1099-1026(200007/08)15:4<258::AID-FFJ906>3.0.CO;2-F
. [all data]
Bartley and Jacobs, 2000
Bartley, J.P.; Jacobs, A.L.,
Effects of drying on flavour compounds in Australian-grown ginger (Zingiber officinale),
J. Sci. Food Agric., 2000, 80, 2, 209-215, https://doi.org/10.1002/(SICI)1097-0010(20000115)80:2<209::AID-JSFA516>3.0.CO;2-8
. [all data]
Lota, de Rocca Serra, et al., 2000
Lota, M.-L.; de Rocca Serra, D.; Tomi, F.; Casanova, J.,
Chemical variability of peel and leaf essential oils of mandarins from Citrus reticulata Blanco,
Biochem. Syst. Ecol., 2000, 28, 1, 61-78, https://doi.org/10.1016/S0305-1978(99)00036-8
. [all data]
Mondello, Zappia, et al., 2000
Mondello, L.; Zappia, G.; Dugo, P.; Dugo, G.; Bonaccorsi, I.; Dugo, G.,
Identification of complex samples by Fast-GC/MS using linear retention indices in conjunction with the MS-library, Proceedings, 23rd ISCC; CD-ROM, 2000, retrieved from http://www.richrom.com/assets/CD23PDF. [all data]
Song, Sawamura, et al., 2000
Song, H.S.; Sawamura, M.; Ito, T.; Ido, A.; Ukeda, H.,
Quantitative determination and characteristic flavour of daidai (Citrus aurantium L. var. cyathifera Y. Tanaka) peel oil,
Flavour Fragr. J., 2000, 15, 5, 323-328, https://doi.org/10.1002/1099-1026(200009/10)15:5<323::AID-FFJ918>3.0.CO;2-J
. [all data]
Verzera, la Rosa, et al., 2000
Verzera, A.; la Rosa, G.; Zappalà, M.; Cotroneo, A.,
Essential oil composition of different cultivars of bergamot grown in Sicily,
Ital. J. Food Sci., 2000, 12, 4, 493-501. [all data]
Verzera, Trozzi, et al., 2000
Verzera, A.; Trozzi, A.; Cotroneo, A.; Lorenzo, D.; Dellacassa, E.,
Uruguayan essential oil. 12. Composition of Nova and Satsuma mandarin oils,
J. Agric. Food Chem., 2000, 48, 7, 2903-2909, https://doi.org/10.1021/jf990734z
. [all data]
Lota, Serra, et al., 1999
Lota, M.-L.; Serra, D.R.; Tomi, F.; Bessiere, J.-M.; Casanova, J.,
Chemical composition of peel and leaf essential oils of Citrus medica L. and C. limonimedica Lush.,
Flavour Fragr. J., 1999, 14, 3, 161-166, https://doi.org/10.1002/(SICI)1099-1026(199905/06)14:3<161::AID-FFJ801>3.0.CO;2-8
. [all data]
Mazzoni, Tomi, et al., 1999
Mazzoni, V.; Tomi, F.; Casanova, J.,
A daucane-type sesquiterpene from Faucus carota seed oil,
Flavour Fragr. J., 1999, 14, 5, 268-272, https://doi.org/10.1002/(SICI)1099-1026(199909/10)14:5<268::AID-FFJ823>3.0.CO;2-Z
. [all data]
Muselli, Hoi, et al., 1999
Muselli, A.; Hoi, T.M.; Cu, L.D.; Moi, L.D.; Bessière, J.-M.; Bighelli, A.; Casanova, J.,
Composition of the essential oil of Acanthopanax trifoliatus (L.) Merr. (Araliacaea) from Vietnam,
Flavour Fragr. J., 1999, 14, 1, 41-44, https://doi.org/10.1002/(SICI)1099-1026(199901/02)14:1<41::AID-FFJ781>3.0.CO;2-B
. [all data]
Sumathykutty, Rao, et al., 1999
Sumathykutty, M.A.; Rao, J.M.; Padmakumari, K.P.; Narayanan, C.S.,
Essential oil constituents of some Piper species,
Flavour Fragr. J., 1999, 14, 5, 279-282, https://doi.org/10.1002/(SICI)1099-1026(199909/10)14:5<279::AID-FFJ821>3.0.CO;2-0
. [all data]
Isidorov, Zenkevich, et al., 1998
Isidorov, V.A.; Zenkevich, I.G.; Dubis, E.N.; Slowikowski, A.; Wojciuk, E.,
Group identification of essential oils components using partition coefficients in a hexane-acetonitrile system,
J. Chromatogr. A, 1998, 814, 1-2, 253-260, https://doi.org/10.1016/S0021-9673(98)00398-7
. [all data]
Mariotti, Costa, et al., 1997
Mariotti, J.P.; Costa, J.; Bianchini, A.; Bernardini, A.F.; Casanova, J.,
Composition and variability of the essential oil of Stachys glutinosa L. from Corsica (France),
Flavour Fragr. J., 1997, 12, 3, 205-209, https://doi.org/10.1002/(SICI)1099-1026(199705)12:3<205::AID-FFJ636>3.0.CO;2-I
. [all data]
Mariotti, Tomi, et al., 1997
Mariotti, J.P.; Tomi, F.; Casanova, J.; Costa, J.; Bernardini, A.F.,
Composition of the essential oil of Cistus Iadaniferus L. cultivated in corsica (France),
Flavour Fragr. J., 1997, 12, 3, 147-151, https://doi.org/10.1002/(SICI)1099-1026(199705)12:3<147::AID-FFJ631>3.0.CO;2-Q
. [all data]
Stashenko, Prada, et al., 1996
Stashenko, E.E.; Prada, N.Q.; Martínez, J.R.,
HRGC/FID/NP and HRGC/MSD study of Colombian Ylang-Ylang (Cananga odorata) oils obtained by different extraction techniques,
J. Hi. Res. Chromatogr., 1996, 19, 6, 353-358, https://doi.org/10.1002/jhrc.1240190609
. [all data]
Vahirua-Lechat, Menut, et al., 1996
Vahirua-Lechat, I.; Menut, C.; Roig, B.; Bessiere, J.M.; Lamaty, G.,
Isoprene related esters, significant components of Pandanus tectorius,
Phytochemistry, 1996, 43, 6, 1277-1279, https://doi.org/10.1016/S0031-9422(96)00386-X
. [all data]
Píry, Príbela, et al., 1995
Píry, J.; Príbela, A.; Durcanská, J.; Farkas, P.,
Fractionation of volatiles from blackcurrant (Ribes nigrum L.) by different extractive methods,
Food Chem., 1995, 54, 1, 73-77, https://doi.org/10.1016/0308-8146(95)92665-7
. [all data]
Bartley and Foley, 1994
Bartley, J.P.; Foley, P.,
Supercritical fluid extraction of Australian-grown ginger (Zingiber officinale),
J. Sci. Food Agric., 1994, 66, 3, 365-371, https://doi.org/10.1002/jsfa.2740660314
. [all data]
Gómez, Ledbetter, et al., 1993
Gómez, E.; Ledbetter, C.A.; Hartsell, P.L.,
Volatile compounds in apricot, plum, and their interspecific hybrids,
J. Agric. Food Chem., 1993, 41, 10, 1669-1676, https://doi.org/10.1021/jf00034a029
. [all data]
Yang, Sugisawa, et al., 1992
Yang, R.; Sugisawa, H.; Nakatani, H.; Tamura, H.; Takagi, N.,
Comparison of odor quality in peel oils of acid citrus,
Nippon Shokuhin Kogyo Gakkaishi, 1992, 39, 1, 16-24, https://doi.org/10.3136/nskkk1962.39.16
. [all data]
Le Quere and Latrasse, 1990
Le Quere, J.-L.; Latrasse, A.,
Composition of the Essential Oils of Blackcurrant Buds (Ribes nigrum L.),
J. Agric. Food Chem., 1990, 38, 1, 3-10, https://doi.org/10.1021/jf00091a001
. [all data]
Chang, Sheng, et al., 1989
Chang, L.P.; Sheng, L.S.; Yang, M.Z.; An, D.K.,
Retention index of essential oil in temperature-programmed capillary column gas chromatography,
Acta Pharm. Sin., 1989, 24, 11, 847-852. [all data]
Pieribattesti, Smadja, et al., 1988
Pieribattesti, J.C.; Smadja, J.; Mondon, J.M.,
Composition of the essential oil of cardamom (Elettaria cardamomum maton)
in Flavors and Fragrances: A World Perspective. Proceedings of the 10th International Congress of Essential Oils, Fragrances and Flavors, Lawrence,B.M.; Mookherjee,B.D.; Willis,B.J., ed(s)., Elsevier, New York, 1988, 697-706. [all data]
Montanarella, Bos, et al., 1986
Montanarella, L.; Bos, R.; Fischer, F.C.,
The Essential Oil in Lamina and Petiole of Heracleum dissectum Leaves,
Planta Medica, 1986, 52, 04, 332-334, https://doi.org/10.1055/s-2007-969171
. [all data]
De Pooter, Omar, et al., 1985
De Pooter, H.L.; Omar, M.N.; Coolsaet, B.A.; Schamp, N.M.,
The Essential Oil of Greater Galanga (Alpinia Galanga) from Malaysia,
Phytochemistry, 1985, 24, 1, 93-96, https://doi.org/10.1016/S0031-9422(00)80814-6
. [all data]
Tret'yakov, 2008
Tret'yakov, K.V.,
Retention Data. NIST Mass Spectrometry Data Center., NIST Mass Spectrometry Data Center, 2008. [all data]
Dharmawan, Kasapis, et al., 2007
Dharmawan, J.; Kasapis, S.; Curran, P.; Johnson, J.R.,
Characterization of volatile compounds in selected citrus fruits from Asia. Part I: freshly-squeezed juice,
Flavour Fragr. J., 2007, 22, 3, 228-232, https://doi.org/10.1002/ffj.1790
. [all data]
Cardeal, da Silva, et al., 2006
Cardeal, Z.L.; da Silva, M.D.R.G.; Marriott, P.J.,
Comprehensive two-dimensional gas chromatography/mass spectrometric analysis of pepper volatiles,
Rapid Commun. Mass Spectrom., 2006, 20, 19, 2823-2836, https://doi.org/10.1002/rcm.2665
. [all data]
Bonaiti, Irlinger, et al., 2005
Bonaiti, C.; Irlinger, F.; Spinnler, H.E.; Engel, E.,
An iterative sensory procedure to select odor-active associations in complex consortia of microorganisms: application to the construction of a cheese model,
J. Dairy Sci., 2005, 88, 5, 1671-1684, https://doi.org/10.3168/jds.S0022-0302(05)72839-3
. [all data]
Sacchetti, Maietti, et al., 2005
Sacchetti, G.; Maietti, S.; Muzzoli, M.; Scaglianti, M.; Manfredini, S.; Radice, M.; Bruni, R.,
Comparative evaluation of 11 essential oils of different origin as functional antioxidants, antiradicals and antimicrobials in foods,
Food Chem., 2005, 91, 4, 621-632, https://doi.org/10.1016/j.foodchem.2004.06.031
. [all data]
Frizzo, Lorenzo, et al., 2004
Frizzo, C.D.; Lorenzo, D.; Dellacassa, E.,
Composition and seasonal variation of the essential oils from two mandarin cultivars of Southern Brazil,
J. Agric. Food Chem., 2004, 52, 10, 3036-3041, https://doi.org/10.1021/jf030685x
. [all data]
Lorenzo, Paz, et al., 2004
Lorenzo, D.; Paz, D.; Davies, P.; Villamil, J.; Vila, R.; Cañigueral, S.; Dellacassa, E.,
Characterization and enantiomeric distribution of some terpenes in the essential oil of a Uruguayan biotype of Salvia sclarea L.,
Flavour Fragr. J., 2004, 19, 4, 303-307, https://doi.org/10.1002/ffj.1282
. [all data]
Filippini, Tomi, et al., 2000
Filippini, M.-H.; Tomi, F.; Casanova, J.,
Composition of the leaf oil of Ferula arrigonii Bocchieri,
Flavour Fragr. J., 2000, 15, 3, 195-198, https://doi.org/10.1002/1099-1026(200005/06)15:3<195::AID-FFJ891>3.0.CO;2-6
. [all data]
Lorenzo, Dellacassa, et al., 2000
Lorenzo, D.; Dellacassa, E.; Atti-Serafini, L.; Santos, A.C.; Frizzo, C.; Paroul, N.; Moyna, P.; Mondello, L.; Dugo, G.,
Composition and stereoanalysis of Cymbopogon winterianus Jowitt oil from Southern Brazil,
Flavour Fragr. J., 2000, 15, 3, 177-181, https://doi.org/10.1002/1099-1026(200005/06)15:3<177::AID-FFJ887>3.0.CO;2-M
. [all data]
Elmore, Erbahadir, et al., 1997
Elmore, J.S.; Erbahadir, M.A.; Mottram, D.S.,
Comparison of dynamic headspace concentration on Tenax with solid phase microextraction for the analysis of aroma volatiles,
J. Agric. Food Chem., 1997, 45, 7, 2638-2641, https://doi.org/10.1021/jf960835m
. [all data]
Mondello, Dugo, et al., 1995
Mondello, L.; Dugo, P.; Basile, A.; Dugo, G.,
Interactive use of linear retention indices, on polar and apolar columns, with a MS-library for reliable identification of complex mixtures,
J. Microcolumn Sep., 1995, 7, 6, 581-591, https://doi.org/10.1002/mcs.1220070605
. [all data]
Pala-Paul, Copeland, et al., 2006
Pala-Paul, J.; Copeland, L.M.; Brophy, J.J.; Goldsack, R.J.,
Essential oil composition of two variants of Prostanthera lasianthos Labill. from Australia,
Biochem. Syst. Ecol., 2006, 34, 1, 48-55, https://doi.org/10.1016/j.bse.2005.04.003
. [all data]
Skocibusic, Bezic, et al., 2006
Skocibusic, M.; Bezic, N.; Dunkic, V.,
Phytochemical composition and antimicrobial activities of the essential oils from Satureja subspicata Vis. growing in Croatia,
Food Chem., 2006, 96, 1, 20-28, https://doi.org/10.1016/j.foodchem.2005.01.051
. [all data]
Bonvehí, 2005
Bonvehí, J.S.,
Investigation of aromatic compounds in roasted cocoa powder,
Eur. Food Res. Technol., 2005, 221, 1-2, 19-29, https://doi.org/10.1007/s00217-005-1147-y
. [all data]
Choi, 2005
Choi, H.-S.,
Characteristic odor components of kumquat (Fortunella japonica Swingle) peel oil,
J. Agric. Food Chem., 2005, 53, 5, 1642-1647, https://doi.org/10.1021/jf040324x
. [all data]
Brophy, Goldsack, et al., 2004
Brophy, J.J.; Goldsack, R.J.; O'Sullivan, W.,
Chemistry of the Australian gymnosperms. Part VII. The leaf oils of the genus Actinostrobus,
Biochem. Syst. Ecol., 2004, 32, 10, 867-873, https://doi.org/10.1016/j.bse.2004.05.001
. [all data]
Gocmen, Gurbuz, et al., 2004
Gocmen, D.; Gurbuz, O.; Rouseff, R.L.; Smoot, J.M.; Dagdelen, A.F.,
Gas chromatographic-olfactometric characterization of aroma active compounds in sun-dried and vacuum-dried tarhana,
Eur. Food Res. Technol., 2004, 218, 6, 573-578, https://doi.org/10.1007/s00217-004-0913-6
. [all data]
Bezic, Skocibusic, et al., 2003
Bezic, N.; Skocibusic, M.; Dunkic, V.; Radonic, A.,
Composition and antimicrobial activity of Achillea clavennae L. essential oil,
Phytother. Res., 2003, 17, 9, 1037-1040, https://doi.org/10.1002/ptr.1290
. [all data]
Bonvehi and Coll, 2003
Bonvehi, J.S.; Coll, F.V.,
Flavour index and aroma profiles of fresh and processed honeys,
J. Sci. Food Agric., 2003, 83, 4, 275-282, https://doi.org/10.1002/jsfa.1308
. [all data]
Jerkovic, Mastelic, et al., 2003
Jerkovic, I.; Mastelic, J.; Milos, M.; Juteau, F.; Masotti, V.; Viano, J.,
Chemical variability of Artemisia vulgaris L. essential oils originated from the Mediterranean area of France and Croatia,
Flavour Fragr. J., 2003, 18, 5, 436-440, https://doi.org/10.1002/ffj.1246
. [all data]
Radonic and Milso, 2003
Radonic, A.; Milso, M.,
Chemical Composition and In Vitro Evaluation of Antioxidant Effect of Free Volatile Compounds From Satureja montana L.,
Free Radical Research, 2003, 37, 6, 673-679, https://doi.org/10.1080/1071576031000105643
. [all data]
Skocibusic and Bezic, 2003
Skocibusic, M.; Bezic, N.,
Chemical composition and antidiarrhoeal activities of winter savory (Satureja montana L.) essential oil,
Pharm. Biol., 2003, 41, 8, 622-626, https://doi.org/10.1080/13880200390502180
. [all data]
Claudela, Dirningera, et al., 2002
Claudela, P.; Dirningera, N.; Etievant, P.,
Effects of water on gas chromatographic column efficiency measurements applied to on-column injections of volatile aroma compounds,
J. Sep. Sci., 2002, 25, 5-6, 365-370, https://doi.org/10.1002/1615-9314(20020401)25:5/6<365::AID-JSSC365>3.0.CO;2-Y
. [all data]
Milos, Radonic, et al., 2001
Milos, M.; Radonic, A.; Bezic, N.; Dunkic, V.,
Localities and seasonal variations in the chemical composition of essential oils of Satureja montana L. and S. cuneifolia Ten,
Flavour Fragr. J., 2001, 16, 3, 157-160, https://doi.org/10.1002/ffj.965
. [all data]
Brophy, Goldsack, et al., 2000
Brophy, J.; Goldsack, R.J.; Bean, A.R.; Forster, P.I.; Lepschi, B.J.,
Leaf essential oils of the genus Leptospermum (Myrtaceae) in eastern Australia. Part 6. Leptospermum polygalifolium and allies,
Flavour Fragr. J., 2000, 15, 4, 271-277, https://doi.org/10.1002/1099-1026(200007/08)15:4<271::AID-FFJ910>3.0.CO;2-E
. [all data]
Choi and Sawamura, 2000
Choi, H.-S.; Sawamura, M.,
Composition of the essential oil of Citrus tamurana Hort. ex Tanaka (Hyuganatsu),
J. Agric. Food Chem., 2000, 48, 10, 4868-4873, https://doi.org/10.1021/jf000651e
. [all data]
Cha, Kim, et al., 1998
Cha, Y.J.; Kim, H.; Cadwallader, K.R.,
Aroma-active compounds in Kimchi during fermentation,
J. Agric. Food Chem., 1998, 46, 5, 1944-1953, https://doi.org/10.1021/jf9706991
. [all data]
Chyau, Mau, et al., 1996
Chyau, C.-C.; Mau, J.-L.; Wu, C.-M.,
Characteristics of the steam-distilled oil and carbon dioxide extract of Zanthoxylum simulans and fruits,
J. Agric. Food Chem., 1996, 44, 4, 1096-1099, https://doi.org/10.1021/jf950577d
. [all data]
Wu and Yang, 1994
Wu, J.-J.; Yang, J.-S.,
Effects of γ irradiation on the volatile compounds of ginger rhizome (Zingiber officinale Roscoe),
J. Agric. Food Chem., 1994, 42, 11, 2574-2577, https://doi.org/10.1021/jf00047a038
. [all data]
Fröhlich, Duque, et al., 1989
Fröhlich, O.; Duque, C.; Schreier, P.,
Volatile constituents of curuba (Passiflora mollissima) fruit,
J. Agric. Food Chem., 1989, 37, 2, 421-425, https://doi.org/10.1021/jf00086a033
. [all data]
Chen and Ho, 1988
Chen, C.-C.; Ho, C.-T.,
Gas chromatographic analysis of volatile components of ginger oil (Zingiber officinale Roscoe) extracted with liquid carbon dioxide,
J. Agric. Food Chem., 1988, 36, 2, 322-328, https://doi.org/10.1021/jf00080a020
. [all data]
Peppard and Ramus, 1988
Peppard, T.L.; Ramus, S.A.,
Use of Kovats' gas chromatographic retention indices in beer flavor studies,
Am. Soc. Brew. Chem. Proc., 1988, 46, 2, 26-30. [all data]
Bertuzzi, Tirillini, et al., 2013
Bertuzzi, G.; Tirillini, B.; Angelini, P.; Venanzoni, R.,
Antioxidative action of Citrus limonum essential oil on scin,
Eur. J. Medicinal Plants, 2013, 3, 1, 1-9, https://doi.org/10.9734/EJMP/2013/1987
. [all data]
Pinheiro, de Queiros, et al., 2013
Pinheiro, P.F.; de Queiros, V.T.; Rondelli, V.M.; Costa, A.V.; MArcelino, T. deP.; Pratissoli, D.,
Insecticidal activity of citronells grass essential oil on Frankliniella schultzei and Myzus persicae,
Cienc. Agrotec. Lavras, 2013, 37, 2, 138-144, https://doi.org/10.1590/S1413-70542013000200004
. [all data]
Sardashti, Valizadeh, et al., 2013
Sardashti, A.R.; Valizadeh, J.; Adhami, Y.,
Variations in the essential oil composition of Peroskia abrotonolides of different growth stage in Baluchestan,
Middle-East J. Sci. Res., 2013, 13, 6, 781-784. [all data]
Bendiabdellah, El Amine Dib, et al., 2012
Bendiabdellah, A.; El Amine Dib, M.; Djabou, N.; Allali, H.; Tabti, B.; Costa, J.; Myseli, A.,
Biological activities and volatile cinstituents of Daucus muricatus L. from Algeria,
Chem. Centr. J., 2012, 6, 48, 1-22. [all data]
Vijayakumar, Duraipandiyan, et al., 2012
Vijayakumar, A.; Duraipandiyan, V.; Jeyarai, B.; Agastian, P.; Raj, M.K.; Ignacimunthu, S.,
Phytochemical analysis and in vitro antimicrobial activity of Illicium griffithii Hook f. Thoms extracts,
Asian Pacific J. Tropical Diseases, 2012, 2, 3, 190-199, https://doi.org/10.1016/S2222-1808(12)60045-0
. [all data]
Alizadeh, Khosh-Khui, et al., 2011
Alizadeh, A.; Khosh-Khui, M.; Javidnia, K.; Firuzi, O.; Jokar, S.M.,
Chemical composition of the essential oil, total phenolic content and antioxidant activity in Origanum maiorana L. (Lamiaceae) cultivated in Iran,
Adv. Environ. Biol., 2011, 5, 8, 2326-2331. [all data]
Menichini, Tundis, et al., 2011
Menichini, F.; Tundis, R.; Bonesi, M.; de Cindio, B.; Loizzo, M.R.; Conforti, F.; Statti, G.A.; Menabeni, R.; Bettini, R.; Menichini, F.,
Chemical composition and bioactivity of Citrus medica L. cv. Diamante essential oil obtained by hydrodistillation, cold-pressing and supercritical carbon dioxide extraction,
Nat. Prod. Res., 2011, 25, 8, 789-799, https://doi.org/10.1080/14786410902900085
. [all data]
Misharina T., 2011
Misharina T.,
Headspace analysis of aroma compounds using porous adsorbents,
Chemistry Chem. Technol., 2011, 5, 3, 347-354. [all data]
Chalchat, Figueredo, et al., 2010
Chalchat, J.-C.; Figueredo, G.; Ozcan, M.M.; Unver, A.,
Effect of hydrodistillation and microwave distillation extraction methods on chemical composition of essential oil of pickling herb and myrtle plants,
South Western J. of Agriculture, 2010, 1, 2, 133-141. [all data]
Dib, Djabou, et al., 2010
Dib, M.ElA.; Djabou, N.; Desjobert, L.-M.; Allali, H.; Tabti, B.; Muselli, A.; Costa, J.,
Characterization of volatile compounds of Daucus crinitus Desf. headspace solid phase microextraction as alternative technique to hydrodistillation,
Chem, Centr. J., 2010, 4, 16, 1-15. [all data]
Mesa-Arango, Betancur-Galvis, et al., 2010
Mesa-Arango, A.C.; Betancur-Galvis, L.; Montiel, J.; Bueno, J.G.; Baena, A.; Duran, D.C.; Martinez, J.R.; Stashenko, E.E.,
Antifungal activity and chemical composition of the essential oils of Lippia alba (Miller) N.E. Brown grown in different regions of Colombia,
J. Essential Oil Res., 2010, 22, 6, 568-574, https://doi.org/10.1080/10412905.2010.9700402
. [all data]
Mirjalili, Salehi, et al., 2010
Mirjalili, M.H.; Salehi, P.; Sonboli, A.; HAdian, J.; Ebrahimi, S.N.; Yousefzadi, M.,
The composition and antibacterial activity of the essential oil of Levisticum officinale Koch flowers and fruits at different developmental stages,
J. Serb. Chem. Soc., 2010, 75, 12, 1661-1669, https://doi.org/10.2298/JSC100524126M
. [all data]
Mishra, Chaudhary, et al., 2010
Mishra, R.K.; Chaudhary, S.; Pandey, R.; Gupta, S.; Mallavarapu, G.R.; Kumar, S.,
Analysis of linalool content in the inflorescence (flower) essential oil and leaf oil of Lippia alba cultivar Kavach,
J. Essen. Oil Res., 2010, 22, 1, 3-7, https://doi.org/10.1080/10412905.2010.9700253
. [all data]
Miyazawa, Kawauchi, et al., 2010
Miyazawa, M.; Kawauchi, Y.; Utsumi, Y.; Takahashi, T.,
Character impact odorants of wild edible plant - Cacalia hastata L. var. orientalis - used in Japanese traditional food,
J. Oleo Sci., 2010, 59, 10, 527-533, https://doi.org/10.5650/jos.59.527
. [all data]
Monsef-Esfahani, Miri, et al., 2010
Monsef-Esfahani, H.R.; Miri, A.; Amini, M.; Amanzadeh, Y.; Hadjiakhoondi, A.; Hajiaghaee, R.; Ajani, Y.,
Seasonal variations in the chemical composition, antioxidant activity and total phenolic content of Teucrium persicum Boiss. essential oils,
Res. J. Biol. Sci., 2010, 5, 7, 492-498, https://doi.org/10.3923/rjbsci.2010.492.498
. [all data]
Radulovic, Dordevic, et al., 2010
Radulovic, N.S.; Dordevic, N.D.; Palic, R.M.,
Volatiles of Pleurospermum austriacum (L.) Hoffm. (Apiaceae),
J. Serbian Chem. Soc., 2010, 75, 12, 1-11, https://doi.org/10.2298/JSC100323127R
. [all data]
Radulovic, Dordevic, et al., 2010, 2
Radulovic, N.; Dordevic, N.; Markovic, M.; Palic, R.,
Volatile constituents of Glechoma Hirsuta Waldst. Kit. and G. Hederacea L. (Lamiaceae),
Bull. Chem. Soc. Ethiop., 2010, 24, 1, 67-76, https://doi.org/10.4314/bcse.v24i1.52962
. [all data]
Safaei-Ghomi, Meshkatalsadat, et al., 2010
Safaei-Ghomi, J.; Meshkatalsadat, M.H.; Asadi, M.,
Analysis of the essential oil of Salvia brachycalyx Boiss. by nano scale injection and antioxidative activity of methanol extract of this plant,
Digest J. Nanomaterials and Biostructures, 2010, 5, 2, 545-549. [all data]
Takeoka, Hobbs, et al., 2010
Takeoka, G.R.; Hobbs, C.; Byeoung-Soo, P.,
Volatile constituents of the aerial parts of Salvia apiana Jepson,
J. Essential Oil. Res., 2010, 22, 3, 241-244, https://doi.org/10.1080/10412905.2010.9700314
. [all data]
Vahirua-Lechat, Mitermite, et al., 2010
Vahirua-Lechat, I.; Mitermite, Y.; Menut, C.,
Aromatic plants of French Polynesia. IV. Composition and chemical variations of the essential oils of leaves of Etlingera cevuga (seeman) R.E. Smith,
J. Essen. Oil Res., 2010, 22, 5, 407-409, https://doi.org/10.1080/10412905.2010.9700357
. [all data]
Gilani, Shah, et al., 2009
Gilani, A.H.; Shah, A.J.; Zubair, A.; Khalid, S.; Kiani, J.; Ahmed, A.; Rasheed, M.; Ahmad, V.U.,
Chemical composition and mechanisms underlying the spasmolytic and bronchodilatory properties of the essential oil of Nepeta cataria L.,
J. Ethnopharmacology, 2009, 121, 3, 405-411, https://doi.org/10.1016/j.jep.2008.11.004
. [all data]
Koba, Sanda, et al., 2009
Koba, K.; Sanda, K.; Guyon, C.; Raynaud, C.; Chaumont, J.-P.; Nicod, L.,
In vitro cytotoxic activity of Cymbopogon citratus L. and Cymbopogon nardus L. essential oils from Togo,
J. Bangladesh Pharmacological Soc., 2009, 4, 29-34. [all data]
Maridass, 2009
Maridass, M.,
Inter-generic relationships of Ocimum and Origanum based on GC-MS volatile oils data using software NTSPSpc version 2.0,
Ethnobotanical Leaflets, 2009, 13, 83-88. [all data]
Ottavioli, Bighelli, et al., 2009
Ottavioli, J.; Bighelli, A.; Casanova, J.; Bang, B.T.; Y.,
GC (retention indices), GC-MS, and 13C NMR of two citral-rich Cymbopogon leaf oils: C. Flexuosus and C. tortilis,
Spectroscopy Lett., 2009, 42, 8, 506-512, https://doi.org/10.1080/00387010903022350
. [all data]
Porto, Decorti, et al., 2009
Porto, C.Da.; Decorti, D.; Kikic, I.,
Flavour compounds of Lavandula angustifolia L. to use in food manufacturing: comparison of three different extraction methods,
Food Chem., 2009, 112, 4, 1072-1078, https://doi.org/10.1016/j.foodchem.2008.07.015
. [all data]
Scrivanti, Anton, et al., 2009
Scrivanti, L.R.; Anton, A.M.; Zygadlo, J.A.,
Essential oil conposition of Bothriochloa Kuntze (Poaceae) from South America and their chemotaxonomy,
Biochem. Systematics Ecol., 2009, 37, 3, 206-213, https://doi.org/10.1016/j.bse.2009.03.009
. [all data]
Seo, Kim, et al., 2009
Seo, S.-M.; Kim, J.; Lee, S.-G.; Shin, C.-H.; Shin, S.-C.; Park, I.-K.,
Fumigant antitermitic activity of plant essential oils and components from Aiowan (Trachyspermum ammi), Allspice (Pimenta dioica), Caraway (Carum carvi), Dill (Anethum graveolens), Geranium (Pelargonium graveolens), and Litsea (Litsea cubeba( oils against Japanese termite (Reticulitermes speratus Kolbe),
J. Agric. Food Chem., 2009, 57, 15, 6596-6602. [all data]
Wannes, Mhamdi, et al., 2009
Wannes, W.A.; Mhamdi, B.; Marzouk, B.,
GC comparative analysis of least essential oils from two Myrtle varieties at different phenological stages,
Chromatographia, 2009, 69, 1/2, 145-150, https://doi.org/10.1365/s10337-008-0818-9
. [all data]
Aicha, Ines, et al., 2008
Aicha, N.; Ines, S.; Mohamed, B.S.; Ines, B.; Soumaya, K.; Kamel, G.; Mohamed, N.; Imed, C.; Mohamed, H.; Leila, C.-G.,
Chemical composition, mutagenic and antimutagenic activities of essential oils from (Tunisian) Artemisia campestris and Artemisia herba-alba,
J. Ess. Oil Res., 2008, 20, 5, 471-477. [all data]
Mierendorff, Stahl-Biskup, et al., 2008
Mierendorff, H.-G.; Stahl-Biskup, E.; Posthumus, M.A.; van Beek, T.A.,
Composition of commercial Cape chamomile oil (Eriocephalus punctuatus / Eriocephalus tenuifolius), 2008, retrieved from http://www.chemische-analysen-hamburg.de/Publikationen?CapeChamomileOil/. [all data]
Sahraoui, Vian, et al., 2008
Sahraoui, N.; Vian, M.A.; Bornard, I.; Boutekedjiret, C.; Chemat, F.,
Improved microwave steam distillation apparatus for isolation of essential oils. Comparison with conventional steam distillation,
J. Chromatogr. A., 2008, 1210, 2, 229-233, https://doi.org/10.1016/j.chroma.2008.09.078
. [all data]
Wang, Yi, et al., 2008
Wang, Y.; Yi, L.; Liang, Y.; Li, H.; Yuan, D.; Gao, H.; Zeng, M.,
Comparative analysis of essential oil components in Pericarpium Citri Reticulatae Viride and Pericarpium Citri Reticulatae by GC-MS combined with chemometric resolution method,
J. Pharmaceutical and Biomedical Anal., 2008, 46, 1, 66-74, https://doi.org/10.1016/j.jpba.2007.08.030
. [all data]
Argyropoulou, Daferera, et al., 2007
Argyropoulou, C.; Daferera, D.; Tarantilis, P.A.; Fasseas, C.; Polissiou, M.,
Chemical composition of the essential oil from leaves of Lippia citriodora H.B.K. (Verbenaceae) at two developmental stages,
Biochem. Syst. Ecol., 2007, 35, 12, 831-837, https://doi.org/10.1016/j.bse.2007.07.001
. [all data]
Baran, von Reuss, et al., 2007
Baran, S.; von Reuss, S.H.; König, W.A.; Kalemba, D.,
Composition of the essential oil of Abies koreana Wils.,
Flavour Fragr. J., 2007, 22, 1, 78-83, https://doi.org/10.1002/ffj.1762
. [all data]
Ferhat, Meklati, et al., 2007
Ferhat, M.A.; Meklati, B.Y.; Chemat, F.,
Comparison of different isolation methods of essential oil from Citrus fruits: cold pressing, hydrodistillation and microwave dry distillation,
Flavour Fragr. J., 2007, 22, 6, 494-504, https://doi.org/10.1002/ffj.1829
. [all data]
Ferhat, Tigrine-Kordjani, et al., 2007
Ferhat, M.A.; Tigrine-Kordjani, N.; Chemat, S.; Meklati, B.Y.; Chemat, F.,
Rapid Extraction of Volatile Compounds Using a New Simultaneous Microwave Distillation: Solvent Extraction Device,
Chromatographia, 2007, 65, 3-4, 217-222, https://doi.org/10.1365/s10337-006-0130-5
. [all data]
Gil A., Van Baren C.M., et al., 2007
Gil A.; Van Baren C.M.; Lira P.M.D.L.; Bandoni A.L.,
Identification of the genotype from the content and composition of the essential oil of lemon verbena (Aloysia citriodora Palau),
J. Agric. Food Chem., 2007, 55, 21, 8664-8669, https://doi.org/10.1021/jf0708387
. [all data]
Heravi and Sereshti, 2007
Heravi, M.J.; Sereshti, H.,
Determination of Essential Oil Components of Artemisia haussknechtii Boiss. using Simultaneous Hydrodistillation-Static Headspace Liquid Phase Microextraction - Gas Chromatography Mass Spectrometry,
J. Chromatogr. A, 2007, 1160, 1-2, 81-89, https://doi.org/10.1016/j.chroma.2007.05.096
. [all data]
Kiran, Devi, et al., 2007
Kiran, S.R.; Devi, P.S.; Reddy, K.J.,
Bioactivity of essential oils and sesquiterpenes of Chloroxylon swietenia DC against Helicoverpa armigera,
Current Science, 2007, 93, 4, 544-548. [all data]
Monser-Esfahani, Karamkhani, et al., 2007
Monser-Esfahani, H.R.; Karamkhani, F.; Nickavar, B.; Abdi, K.; Faramarzi, M.A.,
The Volatile Constituents of Dracocephalum kotschyi Oils,
Chem. Nat. Comp., 2007, 43, 1, 40-43, https://doi.org/10.1007/s10600-007-0027-z
. [all data]
Oliveira, Leitão, et al., 2007
Oliveira, D.R.; Leitão, G.G.; Bizzo, H.R.; Lopes, D.; Alviano, D.S.; Alviano, C.S.; Leitão, S.G.,
Chemical and antimicrobial analyses of essential oil of Lippia origanoides H.B.K,
Food Chem., 2007, 101, 1, 236-240, https://doi.org/10.1016/j.foodchem.2006.01.022
. [all data]
Salehi, Fakhari, et al., 2007
Salehi, P.; Fakhari, A.R.; Ebrahimi, S.N.; Heydari, R.,
Rapid essential oil screening of Rosmarinus officinalis L. by hydrodistillation-headspace solvent microextraction,
Flavour Fragr. J., 2007, 22, 4, 280-285, https://doi.org/10.1002/ffj.1793
. [all data]
Sereshti and Samadi, 2007
Sereshti, H.; Samadi, S.,
Comparison of hydrodistillation-headspace liquid phase microextraction techniques with hydrodistillation in determination of essential oils in Artemisia Haussknechtii Boiss,
JSUT, 2007, 33, 2, 7-17. [all data]
Sylvestre, Pichette, et al., 2007
Sylvestre, M.; Pichette, A.; Longtin, A.; Martin, M.-A.C.; Bercion, S.R.; Legault, J.,
Chemical composition of leaf essential oil of Hedyosmum arborescens and evaluation of its anticancer activity,
Natural Product Communications, 2007, 2, 12, 1269-1272. [all data]
Bertrand, Comte, et al., 2006
Bertrand, C.; Comte, G.; Piola, F.,
Solid-phase microextraction of volatile compounds from flowers of two Brunfelsia species,
Biochem. Syst. Ecol., 2006, 34, 5, 371-375, https://doi.org/10.1016/j.bse.2005.12.005
. [all data]
Bozin, Mimicá-Dukic, et al., 2006
Bozin, B.; Mimicá-Dukic, N.; Simin, N.; Anackov, G.,
Characterization of the volatile composition of essential oils of some lamiaceae spices and the antimicrobial and antioxidant activities of the entire oils,
J. Agric. Food Chem., 2006, 54, 5, 1822-1828, https://doi.org/10.1021/jf051922u
. [all data]
Castel, Fernandez, et al., 2006
Castel, C.; Fernandez, X.; Lizzani-Cuvelier, L.; Perichet, C.; Lavoine, S.,
Characterization of the Chemical Composition of a Byproduct from Siam Benzoin Gum,
J. Agric. Food Chem., 2006, 54, 23, 8848-8854, https://doi.org/10.1021/jf061193y
. [all data]
Fanciullino, Tomi, et al., 2006
Fanciullino, A.-L.; Tomi, F.; Luro, F.; Desjobert, J.M.; Casanova, J.,
Chemical variability of peel and leaf oils of mandarins,
Flavour Fragr. J., 2006, 21, 2, 359-367, https://doi.org/10.1002/ffj.1658
. [all data]
Farah, Afifi, et al., 2006
Farah, A.; Afifi, A.; Fechtal, M.; Chhen, A.; Satrani, B.; Talbi, M.; Chaouch, A.,
Fractional distillation effect on the chemical composition of Moroccan myrtle (Myrtus communis L.) essential oils,
Flavour Fragr. J., 2006, 21, 2, 351-354, https://doi.org/10.1002/ffj.1651
. [all data]
Figuérédo, Cabassu, et al., 2006
Figuérédo, G.; Cabassu, P.; Chalchat, J.-C.; Pasquier, B.,
Studies of Mediterranean oregano populations. VIII. Chemical composition of essential oils of oreganos of various origins,
Flavour Fragr. J., 2006, 21, 1, 134-139, https://doi.org/10.1002/ffj.1543
. [all data]
Hadian, Sonboli, et al., 2006
Hadian, J.; Sonboli, A.; Ebrahimi, S.N.; Mirjalili, M.H.,
Essential oil composition of Nepeta satureioides from Iran,
Chem. Nat. Compd. (Engl. Transl.), 2006, 42, 2, 175-177, https://doi.org/10.1007/s10600-006-0071-0
. [all data]
Hymete, Rohloff, et al., 2006
Hymete, A.; Rohloff, J.; Iversen, T.-H.,
Essential oil from seeds and husks of Aframomum corrorima from Ethiopia,
Flavour Fragr. J., 2006, 21, 4, 642-644, https://doi.org/10.1002/ffj.1634
. [all data]
Jirovetz, Eller, et al., 2006
Jirovetz, L.; Eller, G.; Buchbauer, G.; Schmidt, E.; Denkova, Z.; Stoyanova, A.S.; Nikolova R.; Geissler, M.,
Chemical composition, antimicrobial activities and odor descriptions of some essential oils with characteristic floral-rosy scent and of their principal aroma compounds,
Recent. Res. Devel. Agronomy Horticulture, 2006, 2, 1-12. [all data]
Kiran, Bhavani, et al., 2006
Kiran, S.R.; Bhavani, K.; Devi, P.S.; Rao, B.R.R.; Reddy, K.J.,
Composition and alrvicidal activity of leaves and stem essential oils of Chloroxylon swietenia DC against Aedes aegypti and Anopheles stephensi,
Biores. Technol., 2006, 97, 18, 2481-2484, https://doi.org/10.1016/j.biortech.2005.10.003
. [all data]
Kula, Izydorczyk, et al., 2006
Kula, J.; Izydorczyk, K.; Czajkowska, A.; Bonikowski, R.,
Chemical composition of carrot umbel oils from Daucus carota L. ssp. sativus cultivated in Poland,
Flavour Fragr. J., 2006, 21, 4, 667-669, https://doi.org/10.1002/ffj.1646
. [all data]
Lan Phi N.T., Nishiyama C., et al., 2006
Lan Phi N.T.; Nishiyama C.; Choi H.-S.; Sawamura M.,
Evaluation of aroma characteristic compounds of Citrus natsudaidai Hayata (Natsudaidai) cold-pressed peel oil,
Biosci. Biotechnol. Biochem., 2006, 70, 8, 1832-1838, https://doi.org/10.1271/bbb.50705
. [all data]
Lis and Milczarek, 2006
Lis, A.; Milczarek, J.,
Chemical composition of the essential oils from fruits, leaves and flowers of Phellodendron sachalinense (Fr. Schmidt) Sarg.,
Flavour Fragr. J., 2006, 21, 4, 683-686, https://doi.org/10.1002/ffj.1662
. [all data]
Mirza, Navaei, et al., 2006
Mirza, M.; Navaei, M.N.; Dini, M.,
Volatile constituents of essential oils isolated from flowers and leaves of Eupatorium cannabinum L. from Iran,
Iranian J. Pharmaceutical Res., 2006, 2, 149-152. [all data]
Miyazawa and Kawata, 2006
Miyazawa, M.; Kawata, J.,
Identification of the Key Aroma Compounds in Dried Roots of Rubia cordifolia,
L. Oleo Sci., 2006, 55, 1, 37-39, https://doi.org/10.5650/jos.55.37
. [all data]
Orav, Raal, et al., 2006
Orav, A.; Raal, A.; Arak, E.; Müürisepp, M.; Kailas, T.,
Composition of the essential oil of Artemisia absinthium L. of different geographical origin,
Proc. Est. Acad. Sci. Chem., 2006, 55, 3, 155-165. [all data]
Ouamba, Ouabonzi, et al., 2006
Ouamba, J.-M.; Ouabonzi, A.; Ekouya, A.; Bessière, J.-M.; Menut, C.; Abena, A.A.; Banzouzi, J.-T.,
Volatile constituents of the essential oil leaf of Lantana salvifolia Jacq. (Verbenaceae),
Flavour Fragr. J., 2006, 21, 1, 158-161, https://doi.org/10.1002/ffj.1553
. [all data]
Ozel, Gogus, et al., 2006
Ozel, M.Z.; Gogus, F.; Lewis, A.C.,
Comparison of direct thermal desorption with water distillation and superheated water extraction for the analysis of volatile components of Rosa damascena Mill. using GCxGC-TOF/MS,
Anal. Chim. Acta., 2006, 566, 2, 172-177, https://doi.org/10.1016/j.aca.2006.03.014
. [all data]
Pintore G., Chessa M., et al., 2006
Pintore G.; Chessa M.; Manconi P.; Zanetti S.; Deriu A.; Tirillini B.,
Chemical composition and antimicrobial activities of essential oil of stachys glutinosa L. from Sardinia,
Natural Product Communications, 2006, 1, 12, 1133-1136. [all data]
Sawamura, Onishi, et al., 2006
Sawamura, M.; Onishi, Y.; Ikemoto, J.; Tu, N.T.M.; Phi, N.T.L.,
Characteristic odour components of bergamot (Citrus bergamia Risso) essential oil,
Flavour Fragr. J., 2006, 21, 4, 609-615, https://doi.org/10.1002/ffj.1604
. [all data]
Silva, Oliveira, et al., 2006
Silva, N.A.; Oliveira, F.F.; Costa, L.C.B.; Bizzo, H.R.; Oliveira, R.A.,
Caracterização química do óleo essencial da erva cidreira (Lippia alba (Mill.) N. E. Br.) cultivada em Ilhéus na Bahia,
Rev. Bras. Pl. Med., Botucatu, 2006, 8, 3, 52-55. [all data]
Sonboli, Mirjalili, et al., 2006
Sonboli, A.; Mirjalili, M.H.; Yousefzadi, M.,
Antimicrobial activity and composition of the essential oil of Cymbopogon Olivieri (Boiss.) Bor from Iran,
Iranian J. Pharm. Res., 2006, 1, 65-68. [all data]
Stojanovic, Palic, et al., 2006
Stojanovic, G.; Palic, I.; Ursic-Jankovic, J.,
Composition and antimicrobial activity of the essential oil of Micromeria cristata and Micromeria juliana,
Flavour Fragr. J., 2006, 21, 1, 77-79, https://doi.org/10.1002/ffj.1507
. [all data]
Wohlmuth, Smith, et al., 2006
Wohlmuth, H.; Smith, M.K.; Brooks, L.O.; Myers, S.P.; Leach, D.N.,
Essential oil composition of diploid and tetraploid clones of ginger (Zingiber officinale Roscoe) grown in Australia,
J. Agric. Food Chem., 2006, 54, 4, 1414-1419, https://doi.org/10.1021/jf0521799
. [all data]
Wong, Lim, et al., 2006
Wong, K.C.; Lim, T.B.; Ali, D.M.H.,
Essential oil of Homalomena sagittifolia Jungh.,
Flavour Fragr. J., 2006, 21, 5, 786-788, https://doi.org/10.1002/ffj.1714
. [all data]
Yadegarinia, Gachkar, et al., 2006
Yadegarinia, D.; Gachkar, L.; Rezaei, M.B.; Taghizadeh, M.; Astaneh, S.A.; Rasooli, I.,
Biochemical activities of Iranian Mentha piperita L. and Myrtus communis L. essential oils,
Phytochemistry, 2006, 67, 12, 1249-1255, https://doi.org/10.1016/j.phytochem.2006.04.025
. [all data]
Duarte, Figueira, et al., 2005
Duarte, M.C.T.; Figueira, G.M.; Sartoratto, A.; Rehder, V.L.G.; Delarmelina, C.,
Anti-Candida activity of Brazilian medicinal plants,
J. Ethnopharmacol., 2005, 97, 2, 305-311, https://doi.org/10.1016/j.jep.2004.11.016
. [all data]
Fakhari, Salehi, et al., 2005
Fakhari, A.R.; Salehi, P.; Heydari, R.; Ebrahimi, S.N.; Haddad, P.R.,
Hydrodistillation-headspace solvent microextraction, a new method for analysis of the essential oil components of Lavandula angustifolia Mill.,
J. Chromatogr. A, 2005, 1098, 1-2, 14-18, https://doi.org/10.1016/j.chroma.2005.08.054
. [all data]
Figuérédo, Cabassu, et al., 2005
Figuérédo, G.; Cabassu, P.; Chalchat, J.-C.; Pasquier, B.,
Studies of Mediterranean oregano populations- V. Chemical composition of essential oils of oregano: Origanum syriacum L. var. bevanii (Holmes) Ietswaart, O. syriacum L. var. sinaicum (Boiss.) Ietswaart, and O. syriacum L. var. syriacum from Lebanon and Israel,
Flavour Fragr. J., 2005, 20, 164-168. [all data]
Ghasemi Y., Faridi P., et al., 2005
Ghasemi Y.; Faridi P.; Mehregan I.; Mohagheghzadeh A.,
Ferula gummosa fruits: An aromatic antimicrobial agent,
Chem. Nat. Compd. (Engl. Transl.), 2005, 41, 3, 311-314, https://doi.org/10.1007/s10600-005-0138-3
. [all data]
Hamilton, Hall, et al., 2005
Hamilton, J.G.C.; Hall, D.R.; Kirk, W.D.J.,
Identification of a male-produced aggregation pheromone in the western flower thrips,
J. Chem. Ecol., 2005, 31, 6, 1369-1379, https://doi.org/10.1007/s10886-005-1351-z
. [all data]
Petrakis, Roussis, et al., 2005
Petrakis, P.V.; Roussis, V.; Papadimitriou, D.; Vagias, C.; Tsitsimpikou, C.,
The effect of terpenoid extracts from 15 pine species on the feeding behavioural sequence of the late instars of the pine processionary caterpillar Thaumetopoea pityocampa,
Behav. Processes, 2005, 69, 3, 303-322, https://doi.org/10.1016/j.beproc.2004.12.008
. [all data]
Ricci, Fraternale, et al., 2005
Ricci, D.; Fraternale, D.; Giamperi, L.; Bucchini, A.; Epifano, F.; Burini, G.; Curini, M.,
Chemical composition, antimicrobial and antioxidant activity of the essential oil of Teucrium marum (Lamiaceae),
J. Ethnopharmacol., 2005, 98, 1-2, 195-200, https://doi.org/10.1016/j.jep.2005.01.022
. [all data]
Setzer, Noletto, et al., 2005
Setzer, W.N.; Noletto, J.A.; Lawton, R.O.; Haber, W.A.,
Leaf essential oil composition of five Zanthoxylum species from Monteverde, Costa Rica,
Molecular Diversity, 2005, 9, 1-3, 3-13, https://doi.org/10.1007/s11030-005-1298-6
. [all data]
Vichi, Riu-Aumatell, et al., 2005
Vichi, S.; Riu-Aumatell, M.; Mora-Pons, M.; Buxaderas, S.; Lopez-Tamames, E.,
Characterization of Volatiles in Different Dry Gins,
J. Agric. Food Chem., 2005, 53, 26, 10154-10160, https://doi.org/10.1021/jf058121b
. [all data]
Wong, Lee, et al., 2005
Wong, K.C.; Lee, B.C.; Lam, N.F.; Ibrahim, P.,
Essential oils of the rhizomes of Alpinia conchigera Griff. and Alpinia latilabris Ridl.,
Flavour Fragr. J., 2005, 20, 4, 431-433, https://doi.org/10.1002/ffj.1458
. [all data]
Wong and Tan, 2005
Wong, K.C.; Tan, C.H.,
Volatile constituents of the flowers of Clerodendron fragrans (Vent.) R. Br.,
Flavour Fragr. J., 2005, 20, 4, 429-430, https://doi.org/10.1002/ffj.1457
. [all data]
Choi, 2004
Choi, H.-S.,
Volatile constituents of satsuma mandarins growing in Korea,
Flavour Fragr. J., 2004, 19, 5, 406-412, https://doi.org/10.1002/ffj.1283
. [all data]
Kalvandi, Sefidkon, et al., 2004
Kalvandi, R.; Sefidkon, F.; Atri, M.; Mirza, M.,
Analysis of the essential oil of Thymus eriocalyx from Iran,
Flavour Fragr. J., 2004, 19, 4, 341-343, https://doi.org/10.1002/ffj.1312
. [all data]
Lis, Boczek, et al., 2004
Lis, A.; Boczek, E.; Góra, J.,
Chemical composition of the essential oils from fruits, leaves and flowers of the Amur cork tree (Phellodendron amurense Rupr.),
Flavour Fragr. J., 2004, 19, 6, 549-553, https://doi.org/10.1002/ffj.1349
. [all data]
Lopez Arze, Collin, et al., 2004
Lopez Arze, J.B.; Collin, G.; Garneau, F.-X.; Jean, F.-I.; Gagnon, H.,
Essential oils from Bolivia. II. Asteraceae: Ophryosporus heptanthus (Wedd.) H. Rob. et King,
J. Essent. Oil Res., 2004, 16, 4, 374-376, https://doi.org/10.1080/10412905.2004.9698747
. [all data]
Marongiu, Piras, et al., 2004
Marongiu, B.; Piras, A.; Porcedda, S.,
Comparative analysis of the oil and supercritical CO2 extract of Elettaria cardamomum (L.) maton,
J. Agric. Food Chem., 2004, 52, 20, 6278-6282, https://doi.org/10.1021/jf034819i
. [all data]
Mimica-Dukic, Bozin, et al., 2004
Mimica-Dukic, N.; Bozin, B.; Sokovic, M.; Simin, N.,
Antimicrobial and antioxidant activities of Melissa officinalis L. (Lamiaceae) essential oil,
J. Agric. Food Chem., 2004, 52, 9, 2485-2489, https://doi.org/10.1021/jf030698a
. [all data]
Raal, Arak, et al., 2004
Raal, A.; Arak, E.; Orav, A.,
Chemical composition of coriander seed essential oil and their conformity with EP standards,
Agraarteadus, 2004, 15, 4, 234-239. [all data]
Raal, Paaver, et al., 2004
Raal, A.; Paaver, U.; Arak, E.; Orav, A.,
Content and composition of the essential oil of Thymus serpyllum L. growing wild in Estonia,
Medicina (Kaunas), 2004, 40, 8, 795-800. [all data]
Sadeghpour, Asghari, et al., 2004
Sadeghpour, O.; Asghari, G.; Ardekani, M.R.S.,
Composition of essential oil of Artemisia persica Boiss. from Iran,
Iran. J. Pharm. Res., 2004, 3, 65-67. [all data]
Sawamura, Son, et al., 2004
Sawamura, M.; Son, U.-S.; Choi, H.-S.; Kim, M.-S.L.; Phi, N.T.L.; Fears, M.; Kumagai,
Compositional changes in commercial lemon essential oil for aromatherapy,
Int. J. Aromatherapy, 2004, 14, 1, 27-36, https://doi.org/10.1016/j.ijat.2004.02.001
. [all data]
Sawamura, Sou, et al., 2004
Sawamura, M.; Sou, U.-S.; Choi, H.-S.; Kim, M.-S.; Phi, N.T.L.; Fears, M.; Kumagai. C.,
Composition changes in commercial lemon essential oil for aromatherapy,
Int. J. Aromatherapy, 2004, 14, 1, 27-36, https://doi.org/10.1016/j.ijat.2004.02.001
. [all data]
Afsharypuor and Jahromy, 2003
Afsharypuor, S.; Jahromy, M.M.,
Constituents of the essential oil from Tanacetum lingulatum (Boiss.) Bornm.,
J. Essent. Oil Res., 2003, 15, 2, 74-76, https://doi.org/10.1080/10412905.2003.9712069
. [all data]
Choi, 2003
Choi, H.-S.,
Characterization of citrus unshiu (C. unshiu Marcov. forma Miyagawa-wase) blossom aroma by solid-phase microextraction in conjunction with an electronic nose,
J. Agric. Food Chem., 2003, 51, 2, 418-423, https://doi.org/10.1021/jf0114280
. [all data]
Curini, Bianchi, et al., 2003
Curini, M.; Bianchi, A.; Epifano, F.; Bruni, R.; Torta, L.; Zambonelli, A.,
Composition and in vitro antifungal activity of essential oils of Erigeron canadensis and Myrtus communis from France,
Chem. Nat. Compd. (Engl. Transl.), 2003, 39, 2, 191-194, https://doi.org/10.1023/A:1024818015122
. [all data]
Dudai, Larkov, et al., 2003
Dudai, N.; Larkov, O.; Chaimovitsh, D.; Lewinsohn, E.; Freiman, L.; Ravid, U.,
Essential oil compounds of Origanum dayi Post,
Flavour Fragr. J., 2003, 18, 4, 334-337, https://doi.org/10.1002/ffj.1237
. [all data]
Fekam Boyom, Ngouana, et al., 2003
Fekam Boyom, F.; Ngouana, V.; Amvam Zollo, P.H.; Menut, C.; Bessiere, J.M.; Gut, J.; Rosenthal, P.J.,
Composition and anti-plasmodial activities of essential oils from some Cameroonian medicinal plants,
Phytochemistry, 2003, 64, 7, 1269-1275, https://doi.org/10.1016/j.phytochem.2003.08.004
. [all data]
Jirovetz, Buchbauer, et al., 2003
Jirovetz, L.; Buchbauer, G.; Stoyanova, A.S.; Georgiev, E.V.; Damianova, S.T.,
Composition, quality control, and antimicrobial activity of the essential oil of long-time stored dill (Anethum graveolens L.) seeds from Bulgaria,
J. Agric. Food Chem., 2003, 51, 13, 3854-3857, https://doi.org/10.1021/jf030004y
. [all data]
Juteau, Jerkovic, et al., 2003
Juteau, F.; Jerkovic, I.; Masotti, V.; Milos, M.; Mastelic, J.; Bessière, J.-M.; Viano, J.,
Composition and antimicrobial activity of the essential oil of Artemisia absinthium from Croatia and France,
Planta Medica, 2003, 69, 2, 158-161, https://doi.org/10.1055/s-2003-37714
. [all data]
Maia, Taveira, et al., 2003
Maia, J.G.S.; Taveira, F.S.N.; Andrade, E.H.A.; da Silva, M.H.L.; Zoghbi, M.G.B.,
Essential oils of Lippia grandis Schau.,
Flavour Fragr. J., 2003, 18, 5, 417-420, https://doi.org/10.1002/ffj.1241
. [all data]
Mierendorff, Stahl-Biskup, et al., 2003
Mierendorff, H.-G.; Stahl-Biskup, E.; Posthumus, M.A.; van Beek, T.A.,
Composition of commercial Cape chamomile oil (Eriocephalus punctulatus),
Flavour Fragr. J., 2003, 18, 6, 510-514, https://doi.org/10.1002/ffj.1259
. [all data]
Nakahara, Alzoreky, et al., 2003
Nakahara, K.; Alzoreky, N.S.; Yoshihashi, T.; Nguyen, H.T.T.; Trakoontivakorn, G.,
Chemical composition and antifungal activity of essential oil from Cymbopogon nardus (citronella grass),
Japan Agricultural Research Quarterly, 2003, 37, 4, 249-252, https://doi.org/10.6090/jarq.37.249
. [all data]
Pitarokili, Tzakou, et al., 2003
Pitarokili, D.; Tzakou, O.; Loukis, A.; Harvala, C.,
Volatile metabolites from Salvia fruticosa as antifungal agents in soilborne pathogens,
J. Agric. Food Chem., 2003, 51, 11, 3294-3301, https://doi.org/10.1021/jf0211534
. [all data]
Rasooli and Mirmostafa, 2003
Rasooli, I.; Mirmostafa, S.A.,
Bacterial susceptibility to and chemical composition of essential oils from Thymus kotschyanus and Thymus persicus,
J. Agric. Food Chem., 2003, 51, 8, 2200-2205, https://doi.org/10.1021/jf0261755
. [all data]
da Silva, Luz, et al., 2003
da Silva, J.D.; Luz, A.I.R.; da Silva, M.H.L.; Andrade, E.H.A.; Soghbi, M.G.B.; Maia, J.G.S.,
Essential oils of the leaves and stems of four Psidium spp.,
Flavour Fragr. J., 2003, 18, 3, 240-243, https://doi.org/10.1002/ffj.1219
. [all data]
Tu, Onishi, et al., 2003
Tu, N.T.M.; Onishi, Y.; Son, U.S.; Ogawa, E.; Ukeda, H.; Sawamura, M.,
Characteristic odour components of Citrus inflata Hort. Ex Tanaka (Mochiyu) cold-pressed peel oil,
Flavour Fragr. J., 2003, 18, 5, 454-459, https://doi.org/10.1002/ffj.1252
. [all data]
Tu, Onishi, et al., 2003, 2
Tu, N.T.M.; Onishi, Y.; Choi, H.S.; Kondo, Y.; Ukeda, H.; Sawamura, M.,
Characteristic odour components of Citrus sp. (Kiyookadaidai) cold-pressed peel oil,
Flavour Fragr. J., 2003, 18, 6, 515-520, https://doi.org/10.1002/ffj.1260
. [all data]
Caredda, Marongiu, et al., 2002
Caredda, A.; Marongiu, B.; Porcedda, S.; Soro, C.,
Supercritical carbon dioxide extraction and characterization of Laurus nobilis essential oil,
J. Agric. Food Chem., 2002, 50, 6, 1492-1496, https://doi.org/10.1021/jf0108563
. [all data]
Das, Ram, et al., 2002
Das, M.; Ram, G.; Singh, A.; Mallavarapu, G.R.; Ramesh, S.; Ram, M.; Kumar, S.,
Volatile constituents of different plant parts of Chamomilla recutita L. Rausch grown in the Indo-Gangetic plains,
Flavour Fragr. J., 2002, 17, 1, 9-12, https://doi.org/10.1002/ffj.1035
. [all data]
Gancel, Ollé, et al., 2002
Gancel, A.-L.; Ollé, D.; Ollitrault, P.; Luro, F.; Brillouet, J.-M.,
Leaf and peel volatile compounds of an interspecific citrus somatic hybrid [Citrus aurantifolia (Christm.) Swing. + Citrus paradisi Macfayden],
Flavour Fragr. J., 2002, 17, 6, 416-424, https://doi.org/10.1002/ffj.1119
. [all data]
Ghannadi, Sajjadi, et al., 2002
Ghannadi, A.; Sajjadi, S.E.; Beigihasan, A.,
Composition of the essential oil of Ferula ovina (Boiss.) Boiss. from Iran,
DARU, 2002, 10, 4, 165-167, retrieved from http://www1.tums.ac.ir/daru/Daru4%202002/Ghannadi.PDF. [all data]
Juteau, Masotti, et al., 2002
Juteau, F.; Masotti, V.; Bessière, J.-M.,
Compositional characteristics of the essential oil of Artemisia campestris var. glutinosa,
Biochem. Syst. Ecol., 2002, 30, 11, 1065-1070, https://doi.org/10.1016/S0305-1978(02)00052-2
. [all data]
Kim and Lee, 2002
Kim, N.-S.; Lee, D.-S.,
Comparison of different extraction methods for the analysis of fragrances from Lavandula species by gas chromatography-mass spectrometry,
J. Chromatogr. A, 2002, 982, 1, 31-47, https://doi.org/10.1016/S0021-9673(02)01445-0
. [all data]
Lin, Rouseff, et al., 2002
Lin, J.; Rouseff, R.L.; Barros, S.; Naim, M.,
Aroma composition changes in early season grapefruit juice produced from thermal concentration,
J. Agric. Food Chem., 2002, 50, 4, 813-819, https://doi.org/10.1021/jf011154g
. [all data]
Norouzi-Arasi, Yavari, et al., 2002
Norouzi-Arasi, H.; Yavari, I.; Ghaffarzadeh, F.; Mortazavi, M.-S.,
Volatile constituents of Cymbopogon olivieri (Boiss.) Bor from Iran,
Flavour Fragr. J., 2002, 17, 4, 272-274, https://doi.org/10.1002/ffj.1096
. [all data]
Orav, Kailas, et al., 2002
Orav, A.; Kailas, T.; Müürisepp, M.,
Composition of blackcurrant aroma isolated from leaves, buds, and berries of Ribes nigrum L.,
Proc. Est. Acad. Sci. Chem., 2002, 51, 4, 225-234. [all data]
Sefidkon, Jalili, et al., 2002
Sefidkon, F.; Jalili, A.; Mirhaji, T.,
Essential oil composition of three Artemisia spp. from Iran,
Flavour Fragr. J., 2002, 17, 2, 150-152, https://doi.org/10.1002/ffj.1063
. [all data]
Zoghbi, Andrade, et al., 2002
Zoghbi, M.G.B.; Andrade, E.H.A.; da Silva, M.H.L.; Maia, J.G.S.,
Volatile constituents of Lippia lupulina Cham.,
Flavour Fragr. J., 2002, 17, 1, 29-31, https://doi.org/10.1002/ffj.1032
. [all data]
Gupta, Mallavarapu, et al., 2001
Gupta, R.; Mallavarapu, G.R.; Banerjee, S.; Kumar, S.,
Characteristics of an isomenthone-rich somaclonal mutant isolated in a geraniol-rich rose-scented geranium accession of Pelargonium graveolens,
Flavour Fragr. J., 2001, 16, 5, 319-324, https://doi.org/10.1002/ffj.1002
. [all data]
Kamath, Asha, et al., 2001
Kamath, A.; Asha, M.R.; Ravi, R.; Narasimhan, S.; Rajalakshmi, D.,
Comparative study of odour and GC-olfactometric profiles of selected essential oils,
Flavour Fragr. J., 2001, 16, 6, 401-407, https://doi.org/10.1002/ffj.1020
. [all data]
Kim and Lee, 2001
Kim, N.-S.; Lee, D.-S.,
Characterization of Rosemary fragrances by solid phase microextraction and GC-MS,
Analyt. Sci., 2001, 17, Supplement, a383-a386. [all data]
Lota, de Rocca Serra, et al., 2001
Lota, M.-L.; de Rocca Serra, D.; Tomi, F.; Casanova, J.,
Chemical variability of peel and leaf essential oils of 15 species of mandarins,
Biochem. Syst. Ecol., 2001, 29, 1, 77-104, https://doi.org/10.1016/S0305-1978(00)00029-6
. [all data]
Ly, Yamauchi, et al., 2001
Ly, T.N.; Yamauchi, R.; KAto, K.,
Volatile components of the essential oils in Galanga (Alpina officinarum Hance) from Vietnam,
Food Sci. Technol. Res., 2001, 7, 4, 303-306, https://doi.org/10.3136/fstr.7.303
. [all data]
Rousis, Papadogianni, et al., 2001
Rousis, V.; Papadogianni, K.; Vagias, C.; Harvala, C.; Petrakis, P.V.; Ortiz, A.,
Volatile constituents of three Pinus species grown in Greece,
J. Essent. Oil Res., 2001, 13, 2, 118-121, https://doi.org/10.1080/10412905.2001.9699632
. [all data]
Santos-Gomes and Fernandes-Ferreira, 2001
Santos-Gomes, P.C.; Fernandes-Ferreira, M.,
Organ- and season-dependent variation in the essential oil composition of Salvia officinalis L. cultivated at two different sites,
J. Agric. Food Chem., 2001, 49, 6, 2908-2916, https://doi.org/10.1021/jf001102b
. [all data]
Fraternale, Giamperi, et al., 2000
Fraternale, D.; Giamperi, L.; Ricci, D.; Manunta, A.,
Composition of the essential oil of Peucedanum verticillare,
Biochem. Syst. Ecol., 2000, 28, 2, 143-147, https://doi.org/10.1016/S0305-1978(99)00049-6
. [all data]
Jirovetz, Puschmann, et al., 2000
Jirovetz, L.; Puschmann, C.; Stojanova, A.; Metodiev, S.; Buchbauer, G.,
Analysis of the essential oil volatiles of Douglas fir (Pseudotsuga menziesii) from Bulgaria,
Flavour Fragr. J., 2000, 15, 6, 434-437, https://doi.org/10.1002/1099-1026(200011/12)15:6<434::AID-FFJ935>3.0.CO;2-0
. [all data]
Kim, Kim, et al., 2000
Kim, H.-J.; Kim, K.; Kim, N.-S.; Lee, D.-S.,
Determination of floral fragrances of Rosa hybrida using solid-phase trapping-solvent extraction and gas chromatography-mass spectrometry,
J. Chromatogr. A, 2000, 902, 2, 389-404, https://doi.org/10.1016/S0021-9673(00)00863-3
. [all data]
Mitiku, Sawamura, et al., 2000
Mitiku, S.B.; Sawamura, M.; Itoh, T.; Ukeda, H.,
Volatile components of peel cold-pressed oils of two cultivars of sweet orange (Citrus sinensis (L.) Osbeck) from Ethiopia,
Flavour Fragr. J., 2000, 15, 4, 240-244, https://doi.org/10.1002/1099-1026(200007/08)15:4<240::AID-FFJ902>3.0.CO;2-F
. [all data]
Choo, Wong, et al., 1999
Choo, L.-C.; Wong, S.-M.; Liew, K.-Y.,
Essential oil of nutmeg pericarp,
J. Sci. Food Agric., 1999, 79, 13, 1954-1957, https://doi.org/10.1002/(SICI)1097-0010(199910)79:13<1954::AID-JSFA460>3.0.CO;2-I
. [all data]
Mallavarapu, Kulkarni, et al., 1999
Mallavarapu, G.R.; Kulkarni, R.N.; Baskaran, K.; Rao, L.; Ramesh, S.,
Influence of plant growth stage on the essential oil content and composition in Davana (Artemisia pallens Wall.),
J. Agric. Food Chem., 1999, 47, 1, 254-258, https://doi.org/10.1021/jf980624c
. [all data]
Mockute and Bernotiene, 1999
Mockute, D.; Bernotiene, G.,
The main citral-geraniol and carvacrol chemotypes of the essential oil of Thymus pulegioides L. growing wild in Vilnius district (Lithuania),
J. Agric. Food Chem., 1999, 47, 9, 3787-3790, https://doi.org/10.1021/jf980987c
. [all data]
Oberhofer, Nikiforov, et al., 1999
Oberhofer, B.; Nikiforov, A.; Buchbauer, G.; Jirovetz, L.; Bicchi, C.,
Investigation of the alteration of the composition of various essential oils used in aroma lamp applications,
Flavour Fragr. J., 1999, 14, 5, 293-299, https://doi.org/10.1002/(SICI)1099-1026(199909/10)14:5<293::AID-FFJ829>3.0.CO;2-T
. [all data]
Sefidkon, Dabiri, et al., 1999
Sefidkon, F.; Dabiri, M.; Rahimi-Bidgoly, A.,
The effect of distillation methods and stage of plant growth on the essential oil content and composition of Thymus kotschyanus Boiss. Hohen,
Flavour Fragr. J., 1999, 14, 6, 405-408, https://doi.org/10.1002/(SICI)1099-1026(199911/12)14:6<405::AID-FFJ853>3.0.CO;2-M
. [all data]
Tropnikova, Zenkevich, et al., 1999
Tropnikova, I.V.; Zenkevich, I.G.; Budantsev, A.L.,
Composition of Essential Oil Nepeta cataria L. var. Citriodora Beck and Features of its Determination,
Rastit. Resursy (Rus.), 1999, 2, 64-69. [all data]
Jantan, Ahmad, et al., 1998
Jantan, I.; Ahmad, A.S.; Bakar, S.A.A.; Ahmad, A.R.; Trockenbrodt, M.; Chak, C.V.,
Constituents of the essential oil of Baeckea frutescens L. from Malaysia,
Flavour Fragr. J., 1998, 13, 4, 245-247, https://doi.org/10.1002/(SICI)1099-1026(1998070)13:4<245::AID-FFJ736>3.0.CO;2-J
. [all data]
Poiana, Sicari, et al., 1998
Poiana, M.; Sicari, V.; Mincione, B.,
Supercritical carbon dioxide (SC-CO2) extraction of grapefruit flavedo,
Flavour Fragr. J., 1998, 13, 2, 125-130, https://doi.org/10.1002/(SICI)1099-1026(199803/04)13:2<125::AID-FFJ708>3.0.CO;2-#
. [all data]
Bos, Woerdenbag, et al., 1997
Bos, R.; Woerdenbag, H.J.; Hendriks, H.; Smit, H.F.; Wikström, H.V.; Scheffer, J.J.C.,
Composition of the essential oil from roots and rhizomes of Valeriana wallichii DC,
Flavour Fragr. J., 1997, 12, 2, 123-131, https://doi.org/10.1002/(SICI)1099-1026(199703)12:2<123::AID-FFJ613>3.0.CO;2-4
. [all data]
Reverchon, Porta, et al., 1997
Reverchon, E.; Porta, G.D.; Gorgoglione, D.,
Supercritical CO2 extraction of volatile oil from rose concrete,
Flavour Fragr. J., 1997, 12, 1, 37-41, https://doi.org/10.1002/(SICI)1099-1026(199701)12:1<37::AID-FFJ605>3.0.CO;2-V
. [all data]
Orav, Kailas, et al., 1996
Orav, A.; Kailas, T.; Liiv, M.,
Analysis of terpenoic composition of conifer needle oils by steam distillation/extraction, gas chromatography and gas chromatography-mass spectrometry,
Chromatographia, 1996, 43, 3/4, 215-219, https://doi.org/10.1007/BF02292955
. [all data]
Rajeswara, Kaul, et al., 1996
Rajeswara, B.R.; Kaul, P.N.; Bhattacharya, A.K.; Mallavarapu, G.R.; Ramesh, S.,
Yield and chemical composition of the essential oils of three Cymbopogon species suffering from iron chlorosis,
Flavour Fragr. J., 1996, 11, 5, 289-293, https://doi.org/10.1002/(SICI)1099-1026(199609)11:5<289::AID-FFJ590>3.0.CO;2-7
. [all data]
Sagrero-Nieves and Bartley, 1996
Sagrero-Nieves, L.; Bartley, J.P.,
Volatile components from the leaves of heterotheca inuloides Cass.,
Flavour Fragr. J., 1996, 11, 1, 49-51, https://doi.org/10.1002/(SICI)1099-1026(199601)11:1<49::AID-FFJ538>3.0.CO;2-J
. [all data]
Dzumayev, Tsibulskaya, et al., 1995
Dzumayev, Kh.K.; Tsibulskaya, I.A.; Zenkevich, I.G.; Tkachenko, K.G.; Satzyperova, I.F.,
Essential Oils od Salvia Sclarea L. Produced from Plants Grown in Southern Uzbekistan,
J. Essent. Oil Res., 1995, 7, 6, 597-604, https://doi.org/10.1080/10412905.1995.9700513
. [all data]
Orav, Kuningas, et al., 1995
Orav, A.; Kuningas, K.; Kailas, T.,
Computerized capillary gas chromatographic identification and determination of Siberian fir oil constituents,
J. Chromatogr. A, 1995, 697, 1-2, 495-499, https://doi.org/10.1016/0021-9673(94)01059-N
. [all data]
Stashenko, Torres, et al., 1995
Stashenko, E.E.; Torres, W.; Morales, J.R.M.,
A study of the compositional variation of the essential oil of ylang-ylang (Cananga odorata Hook Fil. et Thomson, forma genuina) during flower development,
J. Hi. Res. Chromatogr., 1995, 18, 2, 101-104, https://doi.org/10.1002/jhrc.1240180206
. [all data]
Tirado, Stashenko, et al., 1995
Tirado, C.B.; Stashenko, E.E.; Combariza, M.Y.; Martinez, J.R.,
Comparative study of Colombian citrus oils by high-resolution gas chromatography and gas chromatography-mass spectrometry,
J. Chromatogr. A, 1995, 697, 1-2, 501-513, https://doi.org/10.1016/0021-9673(94)00955-9
. [all data]
Gomez and Ledbetter, 1994
Gomez, E.; Ledbetter, C.A.,
Comparative study of the aromatic profiles of two different plum species: Prunus salicina Lindl and Prunus simonii L.,
J. Sci. Food Agric., 1994, 65, 1, 111-115, https://doi.org/10.1002/jsfa.2740650116
. [all data]
Gopalakrishnan, Menon, et al., 1993
Gopalakrishnan, M.; Menon, N.; Padmakumari, K.P.; Jayalekshmy, A.; Narayanan, C.S.,
GC Analysis and Odor Profiles of Four New Indian Genotypes of Piper nigrum L.,
J. Essent. Oil Res., 1993, 5, 3, 247-253, https://doi.org/10.1080/10412905.1993.9698217
. [all data]
Tamura, Yang, et al., 1993
Tamura, H.; Yang, R.-H.; Sugisawa, H.,
Aroma profiles of peel oils of acid citrus,
ACS Sym. Ser., 1993, 525, 121-136. [all data]
Velasco-Negueruela, Pérez Alonso, et al., 1991
Velasco-Negueruela, A.; Pérez Alonso, M.J.; Burzaco, A.,
Aceites esenciales de tomillos ibéricos. VI. Contribución al conocimiento del aceite esencial de thymus capitellatus Hoffmanns. Link,
Anales Jard. Bot. Madrid, 1991, 49, 1, 77-81. [all data]
Yang and Sugisawa, 1990
Yang, R.; Sugisawa, H.,
Citrus Suachi Hort. ex Shirai. Volatile components in Sudachi (Citrus Sudachi Hort. ex Shirai) juice,
Nippon Shokuhin Kogyo Gakkaishi, 1990, 37, 12, 946-952, https://doi.org/10.3136/nskkk1962.37.12_946
. [all data]
Sugisawa, Yamamoto, et al., 1989
Sugisawa, H.; Yamamoto, M.; Tamura, H.; Takagi, N.,
The comparison of volatile components in peel oil from four species of navel orange,
Nippon Shokuhin Kogio Gakkaishi, 1989, 36, 6, 455-462, https://doi.org/10.3136/nskkk1962.36.6_455
. [all data]
Wahab, Aboutabl, et al., 1987
Wahab, S.M.A.; Aboutabl, E.A.; El-Zalabani, S.M.; DePooter, H.L.; Al-Fallaha, B.,
The essential oil of olibanum,
Planta Medica, 1987, 53, 04, 382-384, https://doi.org/10.1055/s-2006-962745
. [all data]
De Pooter and Schamp, 1986
De Pooter, H.L.; Schamp, N.M.,
Comparison of the Volatile Composition of Some Calamintha/Satureja Species,
Prog. Essnt. Oil. Res., 1986, 139-150. [all data]
Flath, Mon, et al., 1983
Flath, R.A.; Mon, T.R.; Lorenz, G.; Whitten, C.J.; Mackley, J.W.,
Volatile components of Acacia sp. blossoms,
J. Agric. Food Chem., 1983, 31, 6, 1167-1170, https://doi.org/10.1021/jf00120a008
. [all data]
VOC BinBase, 2012
VOC BinBase,
The volatile compound BinBase (VOC BinBase), 2012, retrieved from http://fiehnlab.ucdavis.edu/projects/VocBinBase and http://binbase.sourceforge.net. [all data]
Miyazaki, Plotto, et al., 2011
Miyazaki, T.; Plotto, A.; Goodner, K.; Gmitter F.G.,
Distribution of aroma volatile compounds in tangerine hybrids and proposed inheritance,
J. Sci. Food Agric., 2011, 91, 3, 449-460, https://doi.org/10.1002/jsfa.4205
. [all data]
Nance and Setzer, 2011
Nance, M.R.; Setzer, W.N.,
Volatile components of aroma hops (Humulus lupulus L.) commonly used in beer brewing,
J. of Brewing and Distilling, 2011, 2, 2, 16-22. [all data]
Skogerson, Wohlgemuth, et al., 2011
Skogerson, K.; Wohlgemuth, G.; Fiehn, O.,
VocBinNase, 2011, retrieved from http://fiehnlab.ucdavis.edu/projects//VocBinBase. [all data]
Wang, Liu, et al., 2011
Wang, C.F.; Liu, P.; Yang, K.; Zeng, Y.; Liu, Z.L.; Du, S.S.; Deng, Z.W.,
Chemical composition and toxicities of essential oil of Illicium fragesil fruits against Sitophilis zeamais,
African J. Biotechnol., 2011, 10, 79, 18179-18184. [all data]
Dharmawan, Kasapis, et al., 2009
Dharmawan, J.; Kasapis, S.; Sriramula, P.; Lear, M.J.; Curran, P.,
Evaluation of aroma-active compounds in Pontianak orange peel oil (Citrus nobilis Lour. var. microcarpa Hassk.) by gas chromatography - olfactometry, aroma reconstitution, and omission test,
J. Agric. Food Chem., 2009, 57, 1, 239-244, https://doi.org/10.1021/jf801070r
. [all data]
Keefover-Ring, Thompson, et al., 2009
Keefover-Ring, K.; Thompson, J.D.; Linhart, Y.B.,
Beyond six scents: defining a seventh Thymus vulgaris chemotype new to souithern France by ethanol extraction,
Flavour Fragr. J., 2009, 24, 3, 117-122, https://doi.org/10.1002/ffj.1921
. [all data]
Yang, Yang, et al., 2009
Yang, Z.; Yang, W.; Peng, Q.; He, Q.; Feng, Y.; Luo, S.; Yu, Z.,
Volatile phytochemical composition of rhisome of ginger after extraction by headspace solid-phase microextraction, petrol ether extraction and steam distillation extraction,
Bangladesh J. Pharmacol., 2009, 4, 2, 136-143, https://doi.org/10.3329/bjp.v4i2.3232
. [all data]
Costa, De Fina, et al., 2008
Costa, R.; De Fina, M.R.; Valentino, M.R.; Rustaiyan, A.; Dugo, P.; Dugo, G.; Mondello, L.,
An investigation on the volatile composition of some Artemisia species from Iran,
Flavour Fragr. J., 2008, 24, 2, 75-82, https://doi.org/10.1002/ffj.1919
. [all data]
Kristiawan, Sobolik, et al., 2008
Kristiawan, M.; Sobolik, V.; Al-Haddad, M.; Allaf, K.,
Effect of pressure-drop rate on the isolation of cananga oil using instantaneous controlled pressure-drop process,
Chem. Eng. Processing, 2008, 47, 1, 66-75, https://doi.org/10.1016/j.cep.2007.08.011
. [all data]
Ning, Zheng, et al., 2008
Ning, H.; Zheng, F.; Sun, B.; Xie, J.; Liu, Y.,
Solvent-free microwave extraction of essential oil from Zanthoxylum bungeanum Maxim.,
Food Environ. Ind. (Chinese), 2008, 34, 5, 179-184. [all data]
Qiao, Xie, et al., 2008
Qiao, Y.; Xie, B.J.; Zhang, Y.; Zhang, Y.; FAn, G.; Yao, X.L.; Pan, S.Y.,
Characterization of aroma active compounds in fruit juice and peel oil of Junchen sweet orange fruit (Citrus sinensis (L.) Osbeck) by GC-MS and GC-O,
Molecules, 2008, 13, 6, 1333-1344, https://doi.org/10.3390/molecules13061333
. [all data]
Cheriti, Saad, et al., 2007
Cheriti, A.; Saad, A.; Belboukhari, N.; Ghezali, S.,
The essential oil composition of Bubonium graveolens (Forssk.) Maire from the algerian Sahara,
Flavour Fragr. J., 2007, 22, 4, 286-288, https://doi.org/10.1002/ffj.1794
. [all data]
Chokeprasert P., Charles A.L., et al., 2007
Chokeprasert P.; Charles A.L.; Sue K.H.; Huang T.C.,
Volatile components of the leaves, fruits and seeds of wampee [Clausena lansium (Lour.) Skeels],
J. Food Comp. Anal., 2007, 20, 1, 52-56, https://doi.org/10.1016/j.jfca.2006.07.002
. [all data]
Hashemi, Abolghasemi, et al., 2007
Hashemi, P.; Abolghasemi, M.M.; Fakhari, A.R.; Ebrahimi, S.N.; Ahmadi, S.,
Hydrodistillation-Solvent Microextraction and GC-MS Identification of Volatile Components of Artemisia aucheri,
Chromatographia, 2007, 66, 3-4, 283-286, https://doi.org/10.1365/s10337-007-0289-4
. [all data]
Kamatou, Viljoen, et al., 2007
Kamatou, G.P.P.; Viljoen, A.M.; Figueiredo, A.C.; Tilney, P.M.; Van Zyl, R.L.; Barroso, J.G.; Pedro, L.G.; Van Vuuren, S.F.,
Trichomes, essential oil composition and biological activities of Salvia albanicus Benth. and S. dolomitica Codd, two species from the Cape region of Soith Africa,
South African J. Botany, 2007, 73, 1, 102-108, https://doi.org/10.1016/j.sajb.2006.08.001
. [all data]
Merle, Verdeguer, et al., 2007
Merle, H.; Verdeguer, M.; Blázquez, M.A.; Boira, H.,
Chemical composition of the essential oils from Eriocephalus africanus L. var. africanus populations growing in Spain,
Flavour Fragr. J., 2007, 22, 6, 461-464, https://doi.org/10.1002/ffj.1821
. [all data]
Nivinsliene, Butkiene, et al., 2007
Nivinsliene, O.; Butkiene, R.; Gudalevic, A.; Mockute, D.; Meskauskiene, V.; Grigaliunaite, B.,
Influence of urban environment on chemical composition of Tilia cordata essential oil,
Chemija, 2007, 18, 1, 44-49. [all data]
Radusiene, Judzentiene, et al., 2007
Radusiene, J.; Judzentiene, A.; Peciulyte, D.; Janulis, V.,
Essential Oil Composition and Antimicrobial Assay of Acorus calamus Leaves from Different Wild Populations,
Plant Genetic Resources: Characterization and Utilization, 2007, 5, 1, 37-44, https://doi.org/10.1017/S1479262107390928
. [all data]
Suschke, Sporer, et al., 2007
Suschke, U.; Sporer, F.; Schneele, J.; Geiss, H.K.; Reichling, J.,
Antibacterial and Cytotoxic activity of Nepeta cataria L., Nepeta cataria var. citriodora (Beck.) Balb. and Melissa officinalis L. essential oils,
Natural Product Communications, 2007, 2, 12, 1277-1286. [all data]
Chemat, Lucchesi, et al., 2006
Chemat, F.; Lucchesi, M.E.; Smadja, J.; Favretto, L.; Colnaghi, G.; Visinoni, F.,
Microwave accelerated steam distillation of essential oil from lavender: A rapid, clean and environmentally friendly approach,
Anal. Chim. Acta., 2006, 555, 1, 157-160, https://doi.org/10.1016/j.aca.2005.08.071
. [all data]
Jordan, Martinez, et al., 2006
Jordan, M.J.; Martinez, R.M.; Goodner, K.L.; Baldwin, E.A.; Sotomayor, J.A.,
Seasonal variation of Thymus hyemalis Lange and Spanish Thymus vulgaris L. essential oils composition,
Ind. Crops Prod., 2006, 24, 3, 253-263, https://doi.org/10.1016/j.indcrop.2006.06.011
. [all data]
Singh, Marimuthu, et al., 2006
Singh, G.; Marimuthu, P.; de Heluani, C.S.; Catalan, C.A.N.,
Antioxidant and biocidal activities of Carum nigrum (seed) essential oil, oleoresin, and their selected components,
J. Agric. Food Chem., 2006, 54, 1, 174-181, https://doi.org/10.1021/jf0518610
. [all data]
Singh G., Maurya S., et al., 2006
Singh G.; Maurya S.; de Lampasona M.P.; Catalan C.A.N.,
Studies on essential oils, Part 41. Chemical composition, antifungal, antioxidant and sprout suppressant activities of coriander (Coriandrum sativum) essential oil and its oleoresin,
Flavour Fragr. J., 2006, 21, 3, 472-479, https://doi.org/10.1002/ffj.1608
. [all data]
Srivastava, Mallavarapu, et al., 2006
Srivastava, S.; Mallavarapu, G.R.; Rai, S.K.; Singh, D.; Mishra, R.; Pandey-Rai, S.; Kumar, S.,
Composition of the essential oils of the leaves and flowers of Rhus mysurensis Heyne ex Wight Arn growing in the Aravalli mountain range at New Delhi,
Flavour Fragr. J., 2006, 21, 2, 228-229, https://doi.org/10.1002/ffj.1561
. [all data]
Tognolini, Barocelli, et al., 2006
Tognolini, M.; Barocelli, E.; Ballabeni, V.; Bruni, R.; Bianchi, A.; Chiavarini, M.; Impicciatore, M.,
Comparative screening of plant essential oils: Phenylpropanoid moiety as basic core for antiplatelet activity,
Life Sciences, 2006, 78, 13, 1419-1432, https://doi.org/10.1016/j.lfs.2005.07.020
. [all data]
Tuberoso, Barra, et al., 2006
Tuberoso, C.I.G.; Barra, A.; Angioni, A.; Sarritzu, E.; Pirisi, F.M.,
Chemical Composition of Volatiles in Sardinian Myrtle (Myrtus communis L.) Alcoholic Extracts and Essential Oils,
J. Agric. Food Chem., 2006, 54, 4, 1420-1426, https://doi.org/10.1021/jf052425g
. [all data]
Bagci and Baser, 2005
Bagci, E.; Baser, K.H.C.,
Study of the essential oils of Thymus haussknechtii Velen and Thymus kotschyanus Boiss. et Hohen var. kotschyanus (Lamiaceae) taxa from the eastern Anatolian region in Turkey,
Flavour Fragr. J., 2005, 20, 2, 199-202, https://doi.org/10.1002/ffj.1397
. [all data]
Blank, Fontes, et al., 2005
Blank, A.F.; Fontes, S.M.; Carvalho Filho, J.L.S.; Alves, P.B.; Silva-Mann, R.; Mendonça, M.C.; Arrigoni-Blank, M.F.; Rodrigues, M.O.,
Influence of harvest times and drying of leaves on the essential oil of Melissa officinalis L. cultivated in two environments,
Rev. Bras. Pl. Med., Botucatu, 2005, 8, 1, 73-78. [all data]
Judpentienë and Mockutë, 2004
Judpentienë, A.; Mockutë, D.,
Chemical composition of essential oils of Artemisia absinthium L. (wormwood) growing wild in Vilnius,
Chemija, 2004, 15, 4, 64-68. [all data]
Koba, Sanda, et al., 2004
Koba, K.; Sanda, K.; Raynaud, C.; Nenonene, Y.A.; Millet, J.; Chaumont, J.P.,
Activités antimicrobiennes d'huiles essentielles de trois Cymbopogon sp. africains vis-àvis de germes pathogènes d'animaux de compagnie,
Ann. Med. Vet., 2004, 148, 202-206. [all data]
Lo Cantore, Iacobellis, et al., 2004
Lo Cantore, P.; Iacobellis, N.S.; de Marco, A.; Capasso, F.; Senatore, F.,
Antibacterial activity of Coriandrum sativum L. and Foeniculum vulgare Miller Var. vulgare (Miller) essential oils,
J. Agric. Food Chem., 2004, 52, 26, 7862-7866, https://doi.org/10.1021/jf0493122
. [all data]
Miguel, Simões, et al., 2004
Miguel, G.; Simões, M.; Figueiredo, A.C.; Barroso, J.G.; Pedro, L.G.; Carvalho, L.,
Composition and antioxidant activities of the essential oils of Thymus caespititius, Thymus camphoratus and Thymus mastichina,
Food Chem., 2004, 86, 2, 183-188, https://doi.org/10.1016/j.foodchem.2003.08.031
. [all data]
Vinogradov, 2004
Vinogradov, B.A.,
Production, composition, properties and application of essential oils, 2004, retrieved from http://viness.narod.ru. [all data]
Faleiro, Miguel, et al., 2003
Faleiro, M.L.; Miguel, M.G.; Ladeiro, F.; Venancio, F.; Tavares, R.; Brito, J.C.; Figueiredo, A.C.; Barroso, J.G.; Pedro, L.G.,
Antimicrobial activity of essential oils isolated from Portuguese endemic species of Thymus,
Lett. Appl. Microbiol., 2003, 36, 1, 35-40, https://doi.org/10.1046/j.1472-765X.2003.01259.x
. [all data]
Jordán, Martínez, et al., 2003
Jordán, M.J.; Martínez, R.M.; Cases, M.A.; Sotomayor. J.A.,
Watering level effect on Thymus hyemalis lange essential oil yield and composition,
J. Agric. Food Chem., 2003, 51, 18, 5420-5427, https://doi.org/10.1021/jf034335m
. [all data]
Li, Wu, et al., 2002
Li, C.; Wu, H.; Yang, L.; ren, Y.,
Study of the composition of ginger oil from Laifeng,
Flavour Fragr. Cosmetics, 2002, 5, 15-17. [all data]
Figueiredo, Miguel, et al., 2001
Figueiredo, A.C.; Miguel, M.G.; Duarte, A.M.F.; Barroso, J.G.; Pedro, L.G.,
Essential oil composition of Thymus lotocephallus G. López R. Morales, collected during flowering and vegetative phases,
Flavour Fragr. J., 2001, 16, 6, 417-421, https://doi.org/10.1002/ffj.1028
. [all data]
Lermusieau, Bulens, et al., 2001
Lermusieau, G.; Bulens, M.; Collin, S.,
Use of GC-olfactometry to identify the hop aromatic compounds in beer,
J. Agric. Food Chem., 2001, 49, 8, 3867-3874, https://doi.org/10.1021/jf0101509
. [all data]
Petrakis, Tsitsimpikou, et al., 2001
Petrakis, P.V.; Tsitsimpikou, C.; Tzakou, O.; Couladis, M.; Vagias, C.; Roussis, V.,
Needle volatiles from five Pinus species growing in Greece,
Flavour Fragr. J., 2001, 16, 4, 249-252, https://doi.org/10.1002/ffj.990
. [all data]
Dorman, Figueiredo, et al., 2000
Dorman, H.J.D.; Figueiredo, A.C.; Barroso, J.G.; Deans, S.G.,
In vitro evaluation of antioxidant activity of essential oils and their components,
Flavour Fragr. J., 2000, 15, 1, 12-16, https://doi.org/10.1002/(SICI)1099-1026(200001/02)15:1<12::AID-FFJ858>3.0.CO;2-V
. [all data]
Weyerstahl, Marschall, et al., 1999
Weyerstahl, P.; Marschall, H.; Eckhardt. A.; Christiansen, C.,
Constituents of commercial Brazilian Iantana oil,
Flavour Fragr. J., 1999, 14, 1, 15-28, https://doi.org/10.1002/(SICI)1099-1026(199901/02)14:1<15::AID-FFJ777>3.0.CO;2-M
. [all data]
Weyerstahl, Marschall, et al., 1999, 2
Weyerstahl, P.; Marschall, H.; Splittgerber, U.; Son, P.T.; Giang, P.M.; Kaul, V.K.,
Constituents of the essential oil from the fruits of Zanthoxylum rhetsoides Drake from Vietnam and from the aerial parts of Zanthoxylum alatum Roxb. from India,
Flavour Fragr. J., 1999, 14, 4, 225-229, https://doi.org/10.1002/(SICI)1099-1026(199907/08)14:4<225::AID-FFJ818>3.0.CO;2-1
. [all data]
Zenkevich, 1999
Zenkevich, I.G.,
Analytical Parameters of Components of essential Oils for their Gas Chromatographic and Chromato-Mass-Spectral Identification. Acetates of Terpene Alcohols,
Rastitelnye Resursy (Plant Resources), 1999, 35, 1, 30-37. [all data]
Baratta, Dorman, et al., 1998
Baratta, M.T.; Dorman, H.J.; Deans, S.G.; Figueiredo, A.C.; Barroso, J.G.; Ruberto, G.,
Antimicrobial and antioxidant properties of some commercial essential oils,
Flavour Fragr. J., 1998, 13, 4, 235-244, https://doi.org/10.1002/(SICI)1099-1026(1998070)13:4<235::AID-FFJ733>3.0.CO;2-T
. [all data]
Anitescu, Doneanu, et al., 1997
Anitescu, G.; Doneanu, C.; Radulescu, V.,
Isolation of Coriander oil: comparison between steam distillation and supercritical CO2 extraction,
Flavour Fragr. J., 1997, 12, 3, 173-176, https://doi.org/10.1002/(SICI)1099-1026(199705)12:3<173::AID-FFJ630>3.0.CO;2-1
. [all data]
Isidorov, Zenkevich, et al., 1997
Isidorov, V.; Zenkevich, I.; Sacharevich, T.,
Calculation of Gas Chromatographic Retention Indices for Monoterpenes and Terpenoids from Their Physico-Chemical Constants,
Chem. Anal. (Warsaw), 1997, 42, 627-634. [all data]
Shibamoto, 1987
Shibamoto, T.,
Retention Indices in Essential Oil Analysis
in Capillary Gas Chromatography in Essential Oil Analysis, Sandra, P.; Bicchi, C., ed(s)., Hutchig Verlag, Heidelberg, New York, 1987, 259-274. [all data]
Swigar and Silverstein, 1981
Swigar, A.A.; Silverstein, R.M.,
Monoterpenes, Aldrich Chemical Company, Milwaukee, WI, USA, 1981, 130. [all data]
Kurose, Okamura, et al., 2007
Kurose, K.; Okamura, D.; Yatagai, M.,
Composition of the essential oils from the leaves of nine Pinus species and the cones of three of Pinus species,
Flavour Fragr. J., 2007, 22, 1, 10-20, https://doi.org/10.1002/ffj.1609
. [all data]
Cai, Lin, et al., 2006
Cai, J.; Lin, P.; Zhu, X.; Su, Q.,
Comparative analysis of clary sage (S. sclarea L.) oil volatiles by GC-FTIR and GC-MS,
Food Chem., 2006, 99, 2, 401-407, https://doi.org/10.1016/j.foodchem.2005.07.041
. [all data]
Choi H.S., 2006
Choi H.S.,
Lipolytic effects of citrus peel oils and their components,
J. Agric. Food Chem., 2006, 54, 9, 3254-3258, https://doi.org/10.1021/jf052409j
. [all data]
Babu and Kaul, 2005
Babu, K.G.D.; Kaul, V.K.,
Variation in essential oil composition of rose-scented geranium (Pelargonium sp.) distilled by different distillation techniques,
Flavour Fragr. J., 2005, 20, 2, 222-231, https://doi.org/10.1002/ffj.1414
. [all data]
Jirovetz, Buchbauer, et al., 2005
Jirovetz, L.; Buchbauer, G.; Ngassoum, M.B.; Parmentier, M.,
Chemical composition and olfactory characterization of essential oils of fruits and seeds of African pear (Dacryodes edulis (G. Don) H. J. Lam) from Cameroon,
Flavour Fragr. J., 2005, 20, 2, 215-218, https://doi.org/10.1002/ffj.1324
. [all data]
Jirovetz, Buchbauer, et al., 2005, 2
Jirovetz, L.; Buchbauer, G.; Stoyanova, A.; Balinova, A.; Guangjiun, Z.; Xihan, M.,
Solid phase microextraction/gas chromatographic and olfactory analysis of the scent and fixative properties of the essential oil of Rosa damascena L. from China,
Flavour Fragr. J., 2005, 20, 1, 7-12, https://doi.org/10.1002/ffj.1375
. [all data]
Joichi, Yomogida, et al., 2005
Joichi, A.; Yomogida, K.; Awano, K.; Ueda, Y.,
Volatile components of tea-scented modern roses and ancient Chinese roses,
Flavour Fragr. J., 2005, 20, 2, 152-157, https://doi.org/10.1002/ffj.1388
. [all data]
Kulisic, Radonic, et al., 2005
Kulisic, T.; Radonic, A.; Milos, M.,
Inhibition of Lard Oxidation by Fractions of Different Essential Oil,
Grasas y Aceites, 2005, 56, 4, 284-291, https://doi.org/10.3989/gya.2005.v56.i4.94
. [all data]
Njoroge, Koaze, et al., 2005
Njoroge, S.M.; Koaze, H.; Karanja, P.N.; Sawamura, M.,
Essential oil constituents of three varieties of Kenyan sweet oranges (Citrus sinensis),
Flavour Fragr. J., 2005, 20, 1, 80-85, https://doi.org/10.1002/ffj.1377
. [all data]
Ram, Kumar, et al., 2005
Ram, P.; Kumar, B.; Naqvi, A.A.; Verma, R.S.; Patra, N.K.,
Post-harvest storage effect on quantity and quality of rose-scented geranium (Pelargonium sp. cv. 'Bourbon') oil in Uttaranchal,
Flavour Fragr. J., 2005, 20, 6, 666-668, https://doi.org/10.1002/ffj.1544
. [all data]
Choi, 2004, 2
Choi, H.-S.,
Aroma evaluation of an aquatic herb, changpo (Acorus calamus Var. angustatus Bess), by AEDA and SPME,
J. Agric. Food Chem., 2004, 52, 26, 8099-8104, https://doi.org/10.1021/jf040239p
. [all data]
Jiang and Kubota, 2004
Jiang, L.; Kubota, K.,
Differences in the volatile components and their odor characteristics of green and ripe fruits and dried pericarp of Japanese pepper (Xanthoxylum piperitum DC.),
J. Agric. Food Chem., 2004, 52, 13, 4197-4203, https://doi.org/10.1021/jf030663a
. [all data]
Lourens, Reddy, et al., 2004
Lourens, A.C.U.; Reddy, D.; Baser, K.H.C.; Viljoen, A.M.; Van Vuuren, S.F.,
In vitro Biological Activity and Essential Oil Composition of Four Indigenous South Africal Helichrysum Species,
J. Ethnopharmacol., 2004, 95, 2-3, 253-258, https://doi.org/10.1016/j.jep.2004.07.027
. [all data]
Narain, Almeida, et al., 2004
Narain, N.; Almeida, J.N.; Galvão, M.S.; Madruga, M.S.; de Brito, E.S.,
Volatile compounds in passion fruit (Passiflora edulis forma Flavicarpa) and yellow mombin (Spondias mombin L.) fruits obtained by dynamic headspace technique,
Cienc. Tecnol. Aliment. Campinas, 2004, 24, 2, 212-216, https://doi.org/10.1590/S0101-20612004000200009
. [all data]
Mastelic and Jerkovic, 2003
Mastelic, J.; Jerkovic, I.,
Application of co-distillation with superheated pentane vapour to the isolation of unstable essential oils,
Flavour Fragr. J., 2003, 18, 6, 521-526, https://doi.org/10.1002/ffj.1261
. [all data]
Suleimenov, Atazharova, et al., 2003
Suleimenov, E.M.; Atazharova, G.A.; Demirchi, B.; Baser, K.H.C.; Adekenov, S.M.,
Essential oil composition of Artemisia Lercheana and A. Sieversiana of Kazakhstan flora
in Recent problems of development of new medicines of natural origin, Proceedings of symposium, St.Petersburg - Pushkin, 2003, 382-385. [all data]
Tu, Onishi, et al., 2002
Tu, N.T.M.; Onishi, Y.; Choi, H.-S.; Kondo, Y.; Bassore, S.M.; Ukeda, H.; Sawamura, M.,
Characteristic odor components of Citrus sphaerocarpa Tanaka (Kabosu) cold-pressed peel oil,
J. Agric. Food Chem., 2002, 50, 10, 2908-2913, https://doi.org/10.1021/jf011578a
. [all data]
Tu, Thanh, et al., 2002
Tu, N.T.M.; Thanh, L.X.; Une, A.; Ukeda, H.; Sawamura, M.,
Volatile constituents of Vietnamese pummelo, orange, tangerine and lime peel oils,
Flavour Fragr. J., 2002, 17, 3, 169-174, https://doi.org/10.1002/ffj.1076
. [all data]
Christoph, 2001
Christoph, F.,
Chemische Zuzammensetzung und antimikrobielle Eigenschaften der ätherischen Öle von Leptospermum scoparium J. R. et G. Forst. und anderer Teebaumöle der Gattungen Kunzea, Leptospermum und Melaleuca unter besonderer Berücksichtigung von Handelsölen, Dissertation, University of Hamburg, Germany, 2001, 196. [all data]
Jiang and Kubota, 2001
Jiang, L.; Kubota, K.,
Formation by mechanical stimulus of the flavor compounds in young leaves of Japanese pepper (Xanthoxylum piperitum DC.),
J. Agric. Food Chem., 2001, 49, 3, 1353-1357, https://doi.org/10.1021/jf001166m
. [all data]
Buttery, Light, et al., 2000
Buttery, R.G.; Light, D.M.; Nam, Y.; Merrill, G.B.; Roitman, J.N.,
Volatile components of green walnut husks,
J. Agric. Food Chem., 2000, 48, 7, 2858-2861, https://doi.org/10.1021/jf000288b
. [all data]
Chagonda, Makanda, et al., 2000
Chagonda, L.S.; Makanda, C.; Chalchat, J.-C.,
The essential oils of wild and cultivated Cymbopogon validus (Stapf) Stapf ex Burtt Davy and Elionurus muticus (Spreng.) Kunth from Zimbabwe,
Flavour Fragr. J., 2000, 15, 2, 100-104, https://doi.org/10.1002/(SICI)1099-1026(200003/04)15:2<100::AID-FFJ874>3.0.CO;2-Y
. [all data]
Korány, Mednyánszky, et al., 2000
Korány, K.; Mednyánszky, Zs.; Amtmann, M.,
Preliminary results of a recognition method visualizing the aroma and fragrance features,
Acta Aliment., 2000, 29, 2, 187-198, https://doi.org/10.1556/AAlim.29.2000.2.9
. [all data]
Kaya, Baser, et al., 1999
Kaya, A.; Baser, K.H.C.; Demirci, B.; Koca, F.,
The essential oil of Acinos alpinus (L.) Moench growing in Turkey,
Flavour Fragr. J., 1999, 14, 1, 55-59, https://doi.org/10.1002/(SICI)1099-1026(199901/02)14:1<55::AID-FFJ784>3.0.CO;2-Q
. [all data]
Ngassoum, Yonkeu, et al., 1999
Ngassoum, M.B.; Yonkeu, S.; Jirovetz, L.; Buchbauer, G.; Schmaus, G.; Hammerschmidt, F.-J.H.,
Chemical composition of essential oils of Lantana camara leaves and flowers from Cameroon and Madagascar,
Flavour Fragr. J., 1999, 14, 4, 245-250, https://doi.org/10.1002/(SICI)1099-1026(199907/08)14:4<245::AID-FFJ819>3.0.CO;2-X
. [all data]
Molleken U., Sinnwell V., et al., 1998
Molleken U.; Sinnwell V.; Kubeczka K.H.,
TThe essential oil composition of fruits from Smyrnium perfoliatum,
Phytochemistry, 1998, 47, 6, 1079-1083, https://doi.org/10.1016/S0031-9422(98)80076-9
. [all data]
Mölleken, Sinnwell, et al., 1998
Mölleken, U.; Sinnwell, V.; Kubeczka, K.-H.,
Essential oil composition of Smyrnium olusatrum,
Phytochemistry, 1998, 49, 6, 1709-1714, https://doi.org/10.1016/S0031-9422(98)00195-2
. [all data]
Awano, Honda, et al., 1997
Awano, K.; Honda, T.; Ogawa, T.; Suzuki, S.; Matsunaga, Y.,
Volatile components of Phalaenopsis schilleriana Rehb. f.,
Flavour Fragr. J., 1997, 12, 5, 341-344, https://doi.org/10.1002/(SICI)1099-1026(199709/10)12:5<341::AID-FFJ657>3.0.CO;2-L
. [all data]
Nishimura, 1995
Nishimura, O.,
Identification of the characteristic odorants in fresh rhizomes of ginger (Zingiber officinale Roscoe) using aroma extract dilution analysis and modified multidimensional gas chromatography-mass spectroscopy,
J. Agric. Food Chem., 1995, 43, 11, 2941-2945, https://doi.org/10.1021/jf00059a031
. [all data]
Takeoka, Buttery, et al., 1991
Takeoka, G.R.; Buttery, R.G.; Teranishi, R.; Flath, R.A.; Güntert, M.,
Identification of additional pineapple volatiles,
J. Agric. Food Chem., 1991, 39, 10, 1848-1851, https://doi.org/10.1021/jf00010a032
. [all data]
Prompona, Kandylis, et al., 2012
Prompona, K.-D.; Kandylis, P.; Tsakiris, A.; Kanellaki, M.; Kourkoutas, Y.,
Application of alternative technologies for elimination of artificial colorings in alcoholic beverages produced by Citrus medica and potential impact on human health,
Food Nutrition Sci., 2012, 3, 07, 959-969, https://doi.org/10.4236/fns.2012.37127
. [all data]
Baser, Demirci, et al., 2009
Baser, K.H.C.; Demirci, B.; Kurkcuoglu, M.; Satin, F.; Tumen, G.,
Comparative morphological and phytochemical charactertization of Salvia cadmica and S. smyrnaea,
Pak. J. Bot., 2009, 41, 4, 1545-1555. [all data]
Gyawali and Kim, 2009
Gyawali, R.; Kim, K.-S.,
Volatile organic compounds of medicinal values from Nepalese Acorus calamus L.,
Kathmandu Univ. J. Sci. Eng. Technol., 2009, 5, II, 51-65. [all data]
Rowan, Hunt, et al., 2009
Rowan, D.D.; Hunt, M.B.; Dimouro A.; Alspach P.A.; Weskett R.; Volz, R.K.; Gardiner, S.E.; Chagne, D.,
Profiling fruit volatiles in the progeny of a Royal Gala x Granny Smith apple (Malus x domestica) cross,
J. Agr. Food Chem., 2009, 57, 17, 7953-7961, https://doi.org/10.1021/jf901678v
. [all data]
Quijano and Pino, 2006
Quijano, C.E.; Pino, J.A.,
Changes in volatile constituents during the ripening of cocona (Solanum sessiliflorum Dunal) fruit,
Revista CENIC Ciencias Quimicas, 2006, 37, 3, 133-136. [all data]
Suleimenov Y.M., Atazhanova G.A., et al., 2006
Suleimenov Y.M.; Atazhanova G.A.; Ozek T.; Demirci B.; Kulyyasov A.T.; Adekenov S.M.; Baser K.H.C.,
Essential oil composition of three species of Achillea from Kazakhstan,
Chem. Nat. Compd. (Engl. Transl.), 2006, 37, 5, 447-450, https://doi.org/10.1023/A:1014471326724
. [all data]
Kosar, Özek, et al., 2005
Kosar, M.; Özek, T.; Göger, F.; Kürkcüoglu, M.; Hüsnü Can Baser, K.,
Comparison of Microwave-Assisted Hydrodistillation and Hydrodistillation Methods for the Analysis of Volatile Secondary Metabolites,
Pharm. Biol., 2005, 43, 6, 491-495, https://doi.org/10.1080/13880200500220136
. [all data]
Tabanca, Demirci, et al., 2005
Tabanca, N.; Demirci, B.; Kirimer, N.; Baser, K.H.C.; Bedir, E.; Khand, I.A.; Wedge, D.E.,
Gas chromatographic-mass spectrometric analysis of essential oils from Pimpinella aurea, Pimpinella corymbosa, Pimpinella peregrina and Pimpinella puberula gathered from Eastern and Southern Turkey,
J. Chromatogr. A, 2005, 1097, 1-2, 192-198, https://doi.org/10.1016/j.chroma.2005.10.047
. [all data]
Demirci, Paper, et al., 2004
Demirci, F.; Paper, D.H.; Franz, G.; Hüsnü Can Baser, K.,
Investigation of the origanum onites L. essential oil using the Chorioallantoic Membrane (CAM) assay,
J. Agric. Food Chem., 2004, 52, 2, 251-254, https://doi.org/10.1021/jf034850k
. [all data]
Demirci, Baser, et al., 2003
Demirci, B.; Baser, K.H.C.; Yildiz, B.; Bahcecioglu, Z.,
Composition of the essential oils of six endemic Salvia spp. from Turkey,
Flavour Fragr. J., 2003, 18, 2, 116-121, https://doi.org/10.1002/ffj.1173
. [all data]
Kürkcüoglu, Demirci, et al., 2003
Kürkcüoglu, M.; Demirci, B.; Tabanca, N.; Özek, T.; Baser, K.H.C.,
The essential oil of Achillea falcata L.,
Flavour Fragr. J., 2003, 18, 3, 192-194, https://doi.org/10.1002/ffj.1176
. [all data]
Demirci, Baser, et al., 2002
Demirci, B.; Baser, K.H.C.; Tümen, G.,
Composition of the essential oil of Salvia aramiensis Rech. fil. growing in Turkey,
Flavour Fragr. J., 2002, 17, 1, 23-25, https://doi.org/10.1002/ffj.1027
. [all data]
Baser, Demirci, et al., 2001
Baser, K.H.C.; Demirci, B.; Tabanca, N.; Özek, T.; Gören, N.,
Composition of the essential oils of Tanacetum armenum (DC.) Schultz Bip., T. balsamita L., T. chiliophyllum (Fisch. Mey.) Schultz Bip. var. chiliophyllum and T. haradjani (Rech. fil.) Grierson and the enantiomeric distribution of camphor and carvone,
Flavour Fragr. J., 2001, 16, 3, 195-200, https://doi.org/10.1002/ffj.977
. [all data]
Kaya, Demirci, et al., 2001
Kaya, A.; Demirci, B.; Baser, K.H.C.,
The composition of the essential oil of Stachys iberica subsp. stenostachya growing in Turkey,
Chem. Nat. Compd. (Engl. Transl.), 2001, 37, 4, 326-328, https://doi.org/10.1023/A:1013762200024
. [all data]
Kirimer N., Tabanea N., et al., 2001
Kirimer N.; Tabanea N.; Demirci B.; Baser K.H.C.; Duman H.; Aytac Z.,
The essential oil of a new Sideritis species: Sideritis ozturkii Aytac and Aksoy,
Chem. Nat. Compd. (Engl. Transl.), 2001, 37, 3, 234-237, https://doi.org/10.1023/A:1012561806033
. [all data]
Tabanca, Kirimer, et al., 2001
Tabanca, N.; Kirimer, N.; Can Baser, K.H.,
The composition of essential oils from two varieties of Sideritis erythrantha var. erythrantha and var. cedretorum,
Turk. J. Chem., 2001, 25, 201-208. [all data]
Tabanca, Kirimer, et al., 2001, 2
Tabanca, N.; Kirimer, N.; Demirci, B.; Demirci, F.; Can Baser, K.H.,
Composition and antimicrobial activity of the essential oils of Micromeria cristata subsp. phrygia and the enantiomeric distribution of borneol,
J. Agric. Food Chem., 2001, 49, 9, 4300-4303, https://doi.org/10.1021/jf0105034
. [all data]
Tucker, Maciarello, et al., 2001
Tucker, A.O.; Maciarello, M.J.; Alkire, B.H.,
Essential oil of Aeollanthus suaveolens Mart. ex Spreng. (Lamiaceae),
J. Essent. Oil Res., 2001, 13, 3, 198-199, https://doi.org/10.1080/10412905.2001.9699662
. [all data]
Ahmed, Choudhary, et al., 2000
Ahmed, A.; Choudhary, M.I.; Farooq, A.; Demirci, B.; Demirci, F.; Baser, K.H.C.,
Essential oil constituents of the spice Cinnamomum tamala (Ham.) Nees Eberm.,
Flavour Fragr. J., 2000, 15, 6, 388-390, https://doi.org/10.1002/1099-1026(200011/12)15:6<388::AID-FFJ928>3.0.CO;2-F
. [all data]
Baser, Tabanca, et al., 2000
Baser, K.H.C.; Tabanca, N.; Özek, T.; Demirci, B.; Duran, A.; Duman, H.,
Composition of the essential oil of Chaerophyllum aksekiense A. Duran et Duman, a recently described endemic from Turkey,
Flavour Fragr. J., 2000, 15, 1, 43-44, https://doi.org/10.1002/(SICI)1099-1026(200001/02)15:1<43::AID-FFJ864>3.0.CO;2-#
. [all data]
Kerrola and Kallio, 1993
Kerrola, K.; Kallio, H.,
Volatile compounds and odor characteristics of carbon dioxide extract of coriander (Coriandrum sativum L.) fruits,
J. Agric. Food Chem., 1993, 41, 5, 785-790, https://doi.org/10.1021/jf00029a021
. [all data]
Vernin, 1991
Vernin, G.,
Volatile constituents of the essential oil of Santolina chamaecyparissus L.,
J. Essent. Oil Res., 1991, 3, 1, 49-53, https://doi.org/10.1080/10412905.1991.9697907
. [all data]