1,3-Propanediamine, N-(3-aminopropyl)-N-methyl-
- Formula: C7H19N3
- Molecular weight: 145.2459
- IUPAC Standard InChIKey: KMBPCQSCMCEPMU-UHFFFAOYSA-N
- CAS Registry Number: 105-83-9
- Chemical structure:
View 3d structure (requires JavaScript / HTML 5) - Other names: Dipropylamine, 3,3'-diamino-N-methyl-; Bis(γ-aminopropyl)methylamine; Bis(ω-aminopropyl)methylamine; Bis(3-aminopropyl)methylamine; Di(γ-aminopropyl)methylamine; Methylbis(3-aminopropyl)amine; Methyliminobispropylamine; N-Methyl-N,N-bis(3-aminopropyl)amine; N-Methyliminobis propylamine; N,N-Bis(γ-aminopropyl)methylamine; N,N-Bis(3-aminopropyl)methylamine; Propylamine, 3,3'-(methylimino)bis-; 3,3'-Diamino-N-methyldipropylamine; 3,3'-Methyliminobispropylamine; 5-Methyldipropylenetriamine; N-Methyldipropylenetriamine; N-Methylbis(aminopropyl)amine; Methylamine, N,N-bis(3-aminopropyl)-; 1,3-Propanediamine, N1-(3-aminopropyl)-N1-methyl-; NSC 8173

Phase change data

Data compiled as indicated in comments:
BS - Robert L. Brown and Stephen E. Stein
TRC - Thermodynamics Research Center, NIST Boulder Laboratories, Chris Muzny director
Quantity | Value | Units | Method | Reference | Comment |
---|---|---|---|---|---|
Tfus | 243.6 | K | N/A | Anonymous, 1957 | Uncertainty assigned by TRC = 0.6 K; TRC |
Reduced pressure boiling point
Tboil (K) | Pressure (bar) | Reference | Comment |
---|---|---|---|
384.2 | 0.008 | Aldrich Chemical Company Inc., 1990 | BS |

References

Anonymous, 1957
Anonymous, R.,
, Am. Pet. Inst. Res. Proj. 6, Carnegie-Mellon Univ., 1957. [all data]
Aldrich Chemical Company Inc., 1990
Aldrich Chemical Company Inc.,
Catalog Handbook of Fine Chemicals, Aldrich Chemical Company, Inc., Milwaukee WI, 1990, 1. [all data]