Propane, 1,1'-[ethylidenebis(oxy)]bis-
- Formula: C8H18O2
- Molecular weight: 146.2273
- IUPAC Standard InChIKey: MISTZQJSHHTDCF-UHFFFAOYSA-N
- CAS Registry Number: 105-82-8
- Chemical structure:
View 3d structure (requires JavaScript / HTML 5) - Other names: Acetaldehyde, dipropyl acetal; 1,1-Dipropoxyethane; Acetaldehyde di-n-propyl acetal; Dipropyl acetal; n-Propyl acetal; Ethane, 1,1-dipropoxy

Phase change data

Data compiled by: Thermodynamics Research Center, NIST Boulder Laboratories, Chris Muzny director
Quantity | Value | Units | Method | Reference | Comment |
---|---|---|---|---|---|
Tboil | 367.85 | K | N/A | Timmermans, 1927 | Uncertainty assigned by TRC = 0.5 K; source of data not clear |
Tboil | 417. | K | N/A | Adams and Adkins, 1925 | Uncertainty assigned by TRC = 4. K |

References

Timmermans, 1927
Timmermans, J.,
The Melting Point of Organic Substances,
Bull. Soc. Chim. Belg., 1927, 36, 502. [all data]
Adams and Adkins, 1925
Adams, E.W.; Adkins, H.,
Catalysis in Acetal Formation,
J. Am. Chem. Soc., 1925, 47, 1358-67. [all data]