2-Butenedioic acid (Z)-, dibutyl ester
- Formula: C12H20O4
- Molecular weight: 228.2848
- IUPAC Standard InChIKey: JBSLOWBPDRZSMB-FPLPWBNLSA-N
- CAS Registry Number: 105-76-0
- Chemical structure:
View 3d structure (requires JavaScript / HTML 5) - Stereoisomers:
- Other names: Maleic acid, dibutyl ester; Butyl maleate; Dibutyl maleate; DBM; RC Comonomer DBM; Staflex DBM; di-n-Butyl maleate; Bibutyl maleate; 2-Butenedioic acid, dibutyl ester, cis-; Dibutylester kyseliny maleinove; Bisomer DBM; Octomer DBM; PX-504; 2-Butenedioic acid (2Z)-, 1,4-dibutyl ester; 2-Butenedioic acid (2Z)-, dibutyl ester; Dibutyl (2z)-2-butenedioate

Phase change data

Data compiled as indicated in comments:
BS - Robert L. Brown and Stephen E. Stein
TRC - Thermodynamics Research Center, NIST Boulder Laboratories, Chris Muzny director
AC - William E. Acree, Jr., James S. Chickos
Quantity | Value | Units | Method | Reference | Comment |
---|---|---|---|---|---|
Tboil | 554.2 | K | N/A | Aldrich Chemical Company Inc., 1990 | BS |
Tboil | 553.40 | K | N/A | Vasil'eva, Naumova, et al., 1990 | Uncertainty assigned by TRC = 0.5 K; TRC |
Enthalpy of vaporization
ΔvapH (kJ/mol) | Temperature (K) | Method | Reference | Comment |
---|---|---|---|---|
41.1 | 270. | A | Stephenson and Malanowski, 1987 | Based on data from 255. to 550. K.; AC |

Kovats' RI, non-polar column, custom temperature program

View large format table.

Column type Active phase I Reference Comment
PackedSE-301505.Ramsey, Lee, et al., 1980He, Chromosorb G HP (80-100 mesh); Column length: 1.5 m; Program: not specified

Normal alkane RI, non-polar column, custom temperature program

View large format table.

Column type Active phase I Reference Comment
CapillaryOV-1, SE-30, Methyl silicone, SP-2100, OV-101, DB-1, etc.1505.Waggott and Davies, 1984Hydrogen; Column length: 50. m; Column diameter: 0.32 mm; Program: not specified
OtherMethyl Silicone1505.Ardrey and Moffat, 1981Program: not specified

References

Aldrich Chemical Company Inc., 1990
Aldrich Chemical Company Inc.,
Catalog Handbook of Fine Chemicals, Aldrich Chemical Company, Inc., Milwaukee WI, 1990, 1. [all data]
Vasil'eva, Naumova, et al., 1990
Vasil'eva, I.I.; Naumova, A.A.; Polyakov, A.A.; Tyvina, T.N.; Kozlova, N.V.,
Vapor pressure and molar volume of liquid tetrahydrofuran, γ- butyrolactone, and dibutyl maleinate at elevated temperatures and pressures,
Zh. Prikl. Khim. (Leningrad), 1990, 63, 1879-81. [all data]
Stephenson and Malanowski, 1987
Stephenson, Richard M.; Malanowski, Stanislaw,
Handbook of the Thermodynamics of Organic Compounds, 1987, https://doi.org/10.1007/978-94-009-3173-2
. [all data]