2-Butenedioic acid (E)-, dibutyl ester
- Formula: C12H20O4
- Molecular weight: 228.2848
- IUPAC Standard InChIKey: JBSLOWBPDRZSMB-BQYQJAHWSA-N
- CAS Registry Number: 105-75-9
- Chemical structure:
View 3d structure (requires JavaScript / HTML 5) - Stereoisomers:
- Other names: Fumaric acid, dibutyl ester; Butyl fumarate; Dibutyl fumarate; RC Comonomer DBF; Staflex DBF; Dibutylester kyseliny fumarove; Dibutyl ester of fumaric acid; Di-n-butyl fumarate; Bisomer DBF; 2-Butenedioic acid (2E)-, 1,4-dibutyl ester; 2-Butenedioic acid (2E)-, dibutyl ester; NSC 140; Dibutyl (2e)-2-butenedioate

Phase change data

Data compiled by: Thermodynamics Research Center, NIST Boulder Laboratories, Chris Muzny director
Quantity | Value | Units | Method | Reference | Comment |
---|---|---|---|---|---|
Tfus | 254.95 | K | N/A | Witschonke, 1954 | Uncertainty assigned by TRC = 0.3 K |
Tfus | 255.25 | K | N/A | Witschonke, 1954 | Uncertainty assigned by TRC = 0.2 K |

Normal alkane RI, non-polar column, temperature ramp

Column type | Active phase | I | Reference | Comment |
---|---|---|---|---|
Capillary | Ultra-1 | 1556. | Okumura, 1991 | 25. m/0.32 mm/0.25 μm, He, 3. K/min; Tstart: 80. C; Tend: 260. C |

Normal alkane RI, non-polar column, custom temperature program

Column type | Active phase | I | Reference | Comment |
---|---|---|---|---|
Capillary | SE-30 | 1558. | Vinogradov, 2004 | Program: not specified |

References

Witschonke, 1954
Witschonke, C.R.,
Freezing point and purity data for some organic compounds,
Anal. Chem., 1954, 26, 562-4. [all data]
Okumura, 1991
Okumura, T.,
retention indices of environmental chemicals on methyl silicone capillary column,
Journal of Environmental Chemistry (Japan), 1991, 1, 2, 333-358, https://doi.org/10.5985/jec.1.333
. [all data]
Vinogradov, 2004
Vinogradov, B.A.,
Production, composition, properties and application of essential oils, 2004, retrieved from http://viness.narod.ru. [all data]