Benzene, (1-methylpropoxy)-
- Formula: C10H14O
- Molecular weight: 150.2176
- IUPAC Standard InChIKey: VJQIPKNMASGCOC-UHFFFAOYSA-N
- CAS Registry Number: 10574-17-1
- Chemical structure:
View 3d structure (requires JavaScript / HTML 5) - Other names: Ether, sec-butyl phenyl; sec-Butoxybenzene; sec-Butyl phenyl ether; 2-Butyl phenyl ether

Phase change data

Data compiled as indicated in comments:
BS - Robert L. Brown and Stephen E. Stein
TRC - Thermodynamics Research Center, NIST Boulder Laboratories, Chris Muzny director
Quantity | Value | Units | Method | Reference | Comment |
---|---|---|---|---|---|
Tboil | 467.7 | K | N/A | Weast and Grasselli, 1989 | BS |
Tboil | 466.15 | K | N/A | Smith, 1933 | Uncertainty assigned by TRC = 3. K; TRC |
Reduced pressure boiling point
Tboil (K) | Pressure (bar) | Reference | Comment |
---|---|---|---|
344.2 | 0.007 | Weast and Grasselli, 1989 | BS |

References

Weast and Grasselli, 1989
CRC Handbook of Data on Organic Compounds, 2nd Editon, Weast,R.C and Grasselli, J.G., ed(s)., CRC Press, Inc., Boca Raton, FL, 1989, 1. [all data]
Smith, 1933
Smith, R.A.,
Studies in the Rearrangements of Phenyl Ethers. The Action of Aluminum Chloride on Butyl Phenyl Ethers,
J. Am. Chem. Soc., 1933, 55, 3718. [all data]