Diethyl malonate
- Formula: C7H12O4
- Molecular weight: 160.1678
- IUPAC Standard InChIKey: IYXGSMUGOJNHAZ-UHFFFAOYSA-N
- CAS Registry Number: 105-53-3
- Chemical structure:
View 3d structure (requires JavaScript / HTML 5) - Other names: Propanedioic acid, diethyl ester; Malonic acid, diethyl ester; Carbethoxyacetic ester; Dicarbethoxymethane; Diethyl propanedioate; Ethyl malonate; Malonic ester; Methanedicarboxylic acid, diethyl ester; NSC 8864; Propanedioic acid, 1,3-diethyl ester; 145601-68-9

Gas phase thermochemistry data

Data compiled as indicated in comments:
ALS - Hussein Y. Afeefy, Joel F. Liebman, and Stephen E. Stein
Quantity | Value | Units | Method | Reference | Comment |
---|---|---|---|---|---|
ΔfH°gas | -190.1 | kcal/mol | Semi | Stewart, 2004 | |
ΔfH°gas | -220.3 ± 1.0 | kcal/mol | Ccb | Verevkin, Beckhaus, et al., 1992 | Hc value was corrected by private communication with authors; ALS |

Condensed phase thermochemistry data

Data compiled as indicated in comments:
ALS - Hussein Y. Afeefy, Joel F. Liebman, and Stephen E. Stein
DH - Eugene S. Domalski and Elizabeth D. Hearing
Quantity | Value | Units | Method | Reference | Comment |
---|---|---|---|---|---|
ΔfH°liquid | -235.8 ± 1.0 | kcal/mol | Ccb | Verevkin, Beckhaus, et al., 1992 | Hc value was corrected by private communication with authors; ALS |
Quantity | Value | Units | Method | Reference | Comment |
ΔcH°liquid | -832.45 ± 0.97 | kcal/mol | Ccb | Verevkin, Beckhaus, et al., 1992 | Hc value was corrected by private communication with authors; Corresponding ΔfHºliquid = -235.80 kcal/mol (simple calculation by NIST; no Washburn corrections); ALS |
Constant pressure heat capacity of liquid
Cp,liquid (cal/mol*K) | Temperature (K) | Reference | Comment |
---|---|---|---|
71.75 | 298.15 | Verevkin, Beckhaus, et al., 1992 | DH |
68.09 | 294.6 | Kolosovskii and Udovenko, 1934 | DH |
68.09 | 294.6 | de Kolossowsky and Udowenko, 1933 | DH |

Phase change data

Data compiled as indicated in comments:
BS - Robert L. Brown and Stephen E. Stein
TRC - Thermodynamics Research Center, NIST Boulder Laboratories, Chris Muzny director
ALS - Hussein Y. Afeefy, Joel F. Liebman, and Stephen E. Stein
DRB - Donald R. Burgess, Jr.
AC - William E. Acree, Jr., James S. Chickos
Quantity | Value | Units | Method | Reference | Comment |
---|---|---|---|---|---|
Tboil | 472.5 | K | N/A | Weast and Grasselli, 1989 | BS |
Tboil | 373.35 | K | N/A | Lecat, 1943 | Uncertainty assigned by TRC = 0.4 K; TRC |
Tboil | 472.05 | K | N/A | Timmermans, 1911 | Uncertainty assigned by TRC = 0.3 K; TRC |
Quantity | Value | Units | Method | Reference | Comment |
Tfus | 221.7 | K | N/A | Timmermans, 1952 | Uncertainty assigned by TRC = 0.5 K; TRC |
Tfus | 224.3 | K | N/A | Palomaa and Mikkila, 1942 | Uncertainty assigned by TRC = 1. K; TRC |
Tfus | 223.25 | K | N/A | Timmermans, 1911 | Uncertainty assigned by TRC = 0.3 K; TRC |
Quantity | Value | Units | Method | Reference | Comment |
ΔvapH° | 15.46 ± 0.05 | kcal/mol | V | Verevkin, Beckhaus, et al., 1992 | Hc value was corrected by private communication with authors; ALS |
ΔvapH° | 15.5 | kcal/mol | N/A | Verevkin, Beckhaus, et al., 1992 | DRB |
Enthalpy of vaporization
ΔvapH (kcal/mol) | Temperature (K) | Method | Reference | Comment |
---|---|---|---|---|
15.5 ± 0.05 | 293. | GS | Verevkin, Beckhaus, et al., 1992 | Steele and coworkers in reference Steele, Chirico, et al., 2002 refer to a personal communication with one of the authors of Verevkin, Beckhaus, et al., 1992—stating that it was established that the compound studied was not diethyl malonate.; AC |
15.1 | 305. | A | Stephenson and Malanowski, 1987 | Based on data from 293. to 318. K.; AC |
14.3 | 399. | A | Stephenson and Malanowski, 1987 | Based on data from 384. to 468. K.; AC |
12.2 | 328. | A | Stephenson and Malanowski, 1987 | Based on data from 313. to 472. K. See also Stull, 1947.; AC |
Antoine Equation Parameters
log10(P) = A − (B / (T + C))
P = vapor pressure (atm)
T = temperature (K)
View plot Requires a JavaScript / HTML 5 canvas capable browser.
Temperature (K) | A | B | C | Reference | Comment |
---|---|---|---|---|---|
313. to 472.1 | 5.89993 | 2864.822 | 13.407 | Stull, 1947 | Coefficents calculated by NIST from author's data. |

Kovats' RI, non-polar column, isothermal

View large format table.

Column type Active phase Temperature (C) I Reference Comment
CapillarySE-30100.1033.Tudor and Moldovan, 1999
CapillarySE-30100.1033.3Tudor, 199740. m/0.35 mm/0.35 μm

Kovats' RI, non-polar column, custom temperature program

View large format table.

Column type Active phase I Reference Comment
CapillarySE-301078.Brander, Kepner, et al., 1980Column length: 80. m; Column diameter: 0.29 mm; Program: not specified
CapillarySE-301083.Brander, Kepner, et al., 1980Column length: 80. m; Column diameter: 0.29 mm; Program: not specified

Kovats' RI, polar column, temperature ramp

View large format table.

Column type Active phase I Reference Comment
CapillarySupelcowax-101595.Wong and Teng, 1994He, 35. C @ 5. min, 3. K/min, 200. C @ 20. min; Column length: 60. m; Column diameter: 0.25 mm

Van Den Dool and Kratz RI, non-polar column, temperature ramp

View large format table.

Column type Active phase I Reference Comment
CapillaryDB-11038.Hancock and Peters, 1991He, 50. C @ 2. min, 10. K/min; Column length: 15. m; Column diameter: 0.53 mm
CapillaryDB-51068.8Hancock and Peters, 1991He, 50. C @ 2. min, 10. K/min; Column length: 15. m; Column diameter: 0.53 mm
CapillaryDB-51069.2Hancock and Peters, 1991He, 50. C @ 2. min, 10. K/min; Column length: 15. m; Column diameter: 0.53 mm
CapillaryDB-51069.2Hancock and Peters, 1991He, 50. C @ 2. min, 10. K/min; Column length: 15. m; Column diameter: 0.53 mm
PackedSE-301035.van den Dool and Kratz, 1963Celite; Tstart: 75. C; Tend: 228. C

Van Den Dool and Kratz RI, non-polar column, custom temperature program

View large format table.

Column type Active phase I Reference Comment
CapillaryHP-5MS1066.9Andriamaharavo, 201430. m/0.25 mm/0.25 μm, He; Program: 60C (1 min) => 5 C/min => 210C => 10 C/min => 280C (15 min)
CapillaryDB-5MS1069.Boulanger and Crouzet, 200130. m/0.25 mm/0.25 μm, H2; Program: 40C (5min) => 2C/min => 200C => 5C/min => 250C (15min)

Van Den Dool and Kratz RI, polar column, temperature ramp

View large format table.

Column type Active phase I Reference Comment
CapillaryZB-Wax1580.Ledauphin, Saint-Clair, et al., 200430. m/0.25 mm/0.15 μm, He, 35. C @ 10. min, 1.8 K/min, 220. C @ 10. min

Van Den Dool and Kratz RI, polar column, custom temperature program

View large format table.

Column type Active phase I Reference Comment
CapillaryDB-Wax1572.Ferrari, Lablanquie, et al., 200460. m/0.25 mm/0.25 μm, He; Program: 35C(0.7min) => 20C/min => 70C => 4C/min => 240C

Normal alkane RI, non-polar column, isothermal

View large format table.

Column type Active phase Temperature (C) I Reference Comment
CapillaryOV-101120.1034.Lipp, Krasnykh, et al., 2008Helium; Column length: 50. m; Column diameter: 0.25 mm
CapillaryOV-101130.1034.Lipp, Krasnykh, et al., 2008Helium; Column length: 50. m; Column diameter: 0.25 mm
CapillaryOV-101140.1032.Lipp, Krasnykh, et al., 2008Helium; Column length: 50. m; Column diameter: 0.25 mm
CapillaryOV-101150.1029.Lipp, Krasnykh, et al., 2008Helium; Column length: 50. m; Column diameter: 0.25 mm
CapillaryOV-101220.1033.Lipp, Krasnykh, et al., 2008Helium; Column length: 50. m; Column diameter: 0.25 mm

Normal alkane RI, non-polar column, temperature ramp

View large format table.

Column type Active phase I Reference Comment
CapillaryHP-51069.Jung, Wichmann, et al., 199925. m/0.20 mm/0.33 μm, 50. C @ 3. min, 5. K/min; Tend: 180. C
CapillaryUltra-11032.Okumura, 199125. m/0.32 mm/0.25 μm, He, 3. K/min; Tstart: 80. C; Tend: 260. C

Normal alkane RI, non-polar column, custom temperature program

View large format table.

Column type Active phase I Reference Comment
CapillaryPolydimethyl siloxane with 5 % Ph groups1069.Robinson, Adams, et al., 2012Program: not specified
CapillaryPolydimethyl siloxane with 5 % Ph groups1072.Robinson, Adams, et al., 2012Program: not specified
CapillarySPB-11043.Bosch-Fuste, Riu-Aumatell, et al., 200730. m/0.25 mm/0.25 μm, He; Program: 40C(10min) => 2C/min => 200C(1min) => 2C/min => 250C (10min)
CapillarySE-301043.Vinogradov, 2004Program: not specified
CapillaryHP-51064.Jordán, Goodner, et al., 200230. m/0.25 mm/0.25 μm; Program: not specified
CapillaryMethyl Silicone1040.Zenkevich, 1999Program: not specified
CapillaryOV-1, SE-30, Methyl silicone, SP-2100, OV-101, DB-1, etc.1035.Waggott and Davies, 1984Hydrogen; Column length: 50. m; Column diameter: 0.32 mm; Program: not specified

Normal alkane RI, polar column, temperature ramp

View large format table.

Column type Active phase I Reference Comment
CapillaryVF-Wax MS1574.Duarte, Dias, et al., 201060. m/0.25 mm/0.25 μm, Helium, 60. C @ 5. min, 3. K/min, 220. C @ 25. min
CapillaryDB-Wax1574.Zhao, Xu, et al., 200930. m/0.25 mm/0.25 μm, Helium, 40. C @ 2. min, 3. K/min, 230. C @ 5. min

Normal alkane RI, polar column, custom temperature program

View large format table.

Column type Active phase I Reference Comment
CapillaryDB-Wax1571.Welke, Manfroi, et al., 201230. m/0.25 mm/0.25 μm, Helium; Program: not specified
CapillaryDB-Wax1572.Welke, Manfroi, et al., 201230. m/0.25 mm/0.25 μm, Helium; Program: not specified
CapillaryDB-Wax1572.Zhao, Xu, et al., 200930. m/0.25 mm/0.25 μm, Helium; Program: not specified
CapillarySupelcowax-101582.Bosch-Fuste, Riu-Aumatell, et al., 200730. m/0.25 mm/0.25 μm, He; Program: 40C(10min) => 2C/min => 200C(1min) => 2C/min => 250C (10min)
CapillaryCarbowax 20M1542.Vinogradov, 2004Program: not specified

References

Stewart, 2004
Stewart, J.J.P.,
Comparison of the accuracy of semiempirical and some DFT methods for predicting heats of formation,
J. Mol. Model, 2004, 10, 1, 6-10, https://doi.org/10.1007/s00894-003-0157-6
. [all data]
Verevkin, Beckhaus, et al., 1992
Verevkin, S.P.; Beckhaus, H.-D.; Ruchardt, C.,
Geminale substituenteneffekte Teil 5α. Standardbildungsenthalpien von alkylsubstituierten Malonsaure- und α-aminocarbonsaureestern,
Thermochim. Acta, 1992, 197, 27-39. [all data]
Kolosovskii and Udovenko, 1934
Kolosovskii, N.A.; Udovenko, W.W.,
Specific heat of liquids. II.,
Zhur. Obshchei Khim., 1934, 4, 1027-1033. [all data]
de Kolossowsky and Udowenko, 1933
de Kolossowsky, N.A.; Udowenko, W.W.,
Mesure des chaleurs specifique moleculaires de quelques liquides,
Compt. rend., 1933, 197, 519-520. [all data]
Weast and Grasselli, 1989
CRC Handbook of Data on Organic Compounds, 2nd Editon, Weast,R.C and Grasselli, J.G., ed(s)., CRC Press, Inc., Boca Raton, FL, 1989, 1. [all data]
Lecat, 1943
Lecat, M.,
Azeotropes of Ethyl Urethane and other Azeotropes,
C. R. Hebd. Seances Acad. Sci., 1943, 217, 273. [all data]
Timmermans, 1911
Timmermans, J.,
Researches on the freezing point of organic liquid compounds,
Bull. Soc. Chim. Belg., 1911, 25, 300. [all data]
Timmermans, 1952
Timmermans, J.,
Freezing points of organic compounds. VVI New determinations.,
Bull. Soc. Chim. Belg., 1952, 61, 393. [all data]
Palomaa and Mikkila, 1942
Palomaa, M.H.; Mikkila, I.,
Etherlike Compounds XXVII Turbid Phases in Compounds with Reactivity Minimums,
Chem. Ber., 1942, 75B, 1659-67. [all data]
Steele, Chirico, et al., 2002
Steele, W.V.; Chirico, R.D.; Cowell, A.B.; Knipmeyer, S.E.; Nguyen, A.,
Thermodynamic Properties and Ideal-Gas Enthalpies of Formation for 1,4-Diisopropylbenzene, 1,2,4,5-Tetraisopropylbenzene, Cyclohexanone Oxime, Dimethyl Malonate, Glutaric Acid, and Pimelic Acid,
J. Chem. Eng. Data, 2002, 47, 4, 725-739, https://doi.org/10.1021/je010088b
. [all data]
Stephenson and Malanowski, 1987
Stephenson, Richard M.; Malanowski, Stanislaw,
Handbook of the Thermodynamics of Organic Compounds, 1987, https://doi.org/10.1007/978-94-009-3173-2
. [all data]
Stull, 1947
Stull, Daniel R.,
Vapor Pressure of Pure Substances. Organic and Inorganic Compounds,
Ind. Eng. Chem., 1947, 39, 4, 517-540, https://doi.org/10.1021/ie50448a022
. [all data]