9,9'-Bianthracene
- Formula: C28H18
- Molecular weight: 354.4425
- IUPAC Standard InChIKey: SXGIRTCIFPJUEQ-UHFFFAOYSA-N
- CAS Registry Number: 1055-23-8
- Chemical structure:
View 3d structure (requires JavaScript / HTML 5) - Other names: 9,9'-Bianthryl; 9-(9-Anthryl)anthracene; 9,9'-Bianthracenyl; 9,9'-Bianthranyl; 9,9'-Dianthracene

Phase change data

Data compiled as indicated in comments:
DRB - Donald R. Burgess, Jr.
AC - William E. Acree, Jr., James S. Chickos
ALS - Hussein Y. Afeefy, Joel F. Liebman, and Stephen E. Stein
Quantity | Value | Units | Method | Reference | Comment |
---|---|---|---|---|---|
ΔsubH° | 148. | kJ/mol | Review | Roux, Temprado, et al., 2008 | There are insufficient literature values to properly evaluated the data and measurements are of low quality and/or there is substantial disagreement with values predicted using thermochemical cycles or estimation methods (trends).; DRB |
Enthalpy of sublimation
ΔsubH (kJ/mol) | Temperature (K) | Method | Reference | Comment |
---|---|---|---|---|
127.9 | 443. | A | Hoyer and Peperle, 1958 | Based on data from 413. to 473. K. See also Stephenson and Malanowski, 1987.; AC |
128.0 ± 4.2 | 413. | V | Hoyer and Peperle, 1958, 2 | Reanalyzed by Pedley, Naylor, et al., 1986, Original value = 125. kJ/mol; ALS |
148. | 293. | V | Magnus, Hartmann, et al., 1951 | ALS |

Condensed phase thermochemistry data

Data compiled as indicated in comments:
DRB - Donald R. Burgess, Jr.
ALS - Hussein Y. Afeefy, Joel F. Liebman, and Stephen E. Stein

Quantity Value Units Method Reference Comment
Δfsolid326.9 ± 4.8kJ/molReviewRoux, Temprado, et al., 2008There are insufficient literature values to properly evaluate the data and insufficient information to construct thermochemical cycles or estimate values for comparison, and one must rely solely upon reported uncertainities and the quality of the measurements. In general, the evaluated uncertainty limits are on the order of (3 to 9) kJ/mol.; DRB
Quantity Value Units Method Reference Comment
Δcsolid-13917.6 ± 3.1kJ/molCcbMagnus, Hartmann, et al., 1951Corresponding Δfsolid = 326.9 kJ/mol (simple calculation by NIST; no Washburn corrections); ALS

Gas phase thermochemistry data

Data compiled by: Donald R. Burgess, Jr.

Quantity Value Units Method Reference Comment
Δfgas475.kJ/molReviewRoux, Temprado, et al., 2008There are insufficient literature values to properly evaluated the data and measurements are of low quality and/or there is substantial disagreement with values predicted using thermochemical cycles or estimation methods (trends).

References

Roux, Temprado, et al., 2008
Roux, M.V.; Temprado, M.; Chickos, J.S.; Nagano, Y.,
Critically Evaluated Thermochemical Properties of Polycyclic Aromatic Hydrocarbons,
J. Phys. Chem. Ref. Data, 2008, 37, 4, 1855-1996. [all data]
Hoyer and Peperle, 1958
Hoyer, H.; Peperle, W.,
Z. Elektrochem., 1958, 62, 61. [all data]
Stephenson and Malanowski, 1987
Stephenson, Richard M.; Malanowski, Stanislaw,
Handbook of the Thermodynamics of Organic Compounds, 1987, https://doi.org/10.1007/978-94-009-3173-2
. [all data]
Hoyer and Peperle, 1958, 2
Hoyer, H.; Peperle, W.,
Dampfdrunkmessungen an organischen substanzen und ihre sublimationswarmen,
Z. Electrochem., 1958, 62, 61-66. [all data]
Pedley, Naylor, et al., 1986
Pedley, J.B.; Naylor, R.D.; Kirby, S.P.,
Thermochemical Data of Organic Compounds, Chapman and Hall, New York, 1986, 1-792. [all data]
Magnus, Hartmann, et al., 1951
Magnus, A.; Hartmann, H.; Becker, F.,
Verbrennungswarmen und resonanzenergien von mehrkernigen aromatischen kohlenwasserstoffen,
Z. Phys. Chem., 1951, 197, 75-91. [all data]