Octadecane, 4-methyl-
- Formula: C19H40
- Molecular weight: 268.5209
- IUPAC Standard InChIKey: GEGZZJBPFKEDHM-UHFFFAOYSA-N
- CAS Registry Number: 10544-95-3
- Chemical structure:
View 3d structure (requires JavaScript / HTML 5) - Other names: Hexadecane, 2-propyl; 4-Methyl octadecane

Phase change data

Data compiled as indicated in comments:
TRC - Thermodynamics Research Center, NIST Boulder Laboratories, Chris Muzny director
AC - William E. Acree, Jr., James S. Chickos
Quantity | Value | Units | Method | Reference | Comment |
---|---|---|---|---|---|
Tfus | 272.2 | K | N/A | Sorensen and Sorensen, 1948 | Uncertainty assigned by TRC = 2. K; TRC |
Enthalpy of vaporization
ΔvapH (kJ/mol) | Temperature (K) | Method | Reference | Comment |
---|---|---|---|---|
63.3 | 460. | A | Stephenson and Malanowski, 1987 | Based on data from 445. to 596. K. See also Dykyj, Svoboda, et al., 1999 and Terres, Brinkmann, et al., 1959.; AC |

Kovats' RI, non-polar column, isothermal

Column type | Active phase | Temperature (C) | I | Reference | Comment |
---|---|---|---|---|---|
Capillary | OV-101 | 190. | 1859. | Kusmierz, Malinski, et al., 1985 | Column length: 22. m; Column diameter: 0.3 mm |
Capillary | Apiezon L | 190. | 1854.7 | Kusmierz, Malinski, et al., 1985 | He; Column length: 20. m; Column diameter: 0.3 mm |
Capillary | SE-52 | 190. | 1857.9 | Kusmierz, Malinski, et al., 1985 | He; Column length: 40. m; Column diameter: 0.3 mm |

Kovats' RI, polar column, isothermal

Column type | Active phase | Temperature (C) | I | Reference | Comment |
---|---|---|---|---|---|
Capillary | Carbowax 20M | 150. | 1857. | Kusmierz, Malinski, et al., 1985 | He; Column length: 30. m; Column diameter: 0.25 mm |

Van Den Dool and Kratz RI, non-polar column, temperature ramp

Column type | Active phase | I | Reference | Comment |
---|---|---|---|---|
Capillary | DB-1 | 1859. | Khorasheh, Gray, et al., 1989 | 35. C @ 3. min, 3. K/min; Tend: 300. C |
Capillary | Cross-Linked Methylsilicone | 1860. | Khorasheh, Gray, et al., 1989 | 5. K/min; Tstart: 40. C; Tend: 300. C |

Van Den Dool and Kratz RI, non-polar column, custom temperature program

Column type | Active phase | I | Reference | Comment |
---|---|---|---|---|
Capillary | DB-5 | 1859. | Zaikin and Borisov, 2002 | He; Column length: 30. m; Column diameter: 0.25 mm; Program: 30C => 5K/min=120C => 10C/min => 270C |

Van Den Dool and Kratz RI, polar column, custom temperature program

Column type | Active phase | I | Reference | Comment |
---|---|---|---|---|
Capillary | CP-Wax 52CB | 1852. | Romeo, Ziino, et al., 2007 | 60. m/0.25 mm/0.25 μm, He; Program: 45C(5min) => 10C/min => 80C => 2C/min => 240C |

Normal alkane RI, non-polar column, temperature ramp

Column type | Active phase | I | Reference | Comment |
---|---|---|---|---|
Capillary | OV-1 | 1860.0 | Krkosova, Kubinec, et al., 2007 | 100. m/0.32 mm/0.25 μm, Helium, 5. K/min, 310. C @ 5. min; Tstart: 30. C |

References

Sorensen and Sorensen, 1948
Sorensen, J.S.; Sorensen, N.A.,
Pristane II. The Methyloctadecanes,
Acta Chem. Scand., 1948, 2, 166. [all data]
Stephenson and Malanowski, 1987
Stephenson, Richard M.; Malanowski, Stanislaw,
Handbook of the Thermodynamics of Organic Compounds, 1987, https://doi.org/10.1007/978-94-009-3173-2
. [all data]
Dykyj, Svoboda, et al., 1999
Dykyj, J.; Svoboda, J.; Wilhoit, R.C.; Frenkel, M.L.; Hall, K.R.,
Vapor Pressure of Chemicals: Part A. Vapor Pressure and Antoine Constants for Hydrocarbons and Sulfur, Selenium, Tellurium and Hydrogen Containing Organic Compounds, Springer, Berlin, 1999, 373. [all data]
Terres, Brinkmann, et al., 1959
Terres, E.; Brinkmann, L.; Fischer, D.; Hüllstrung, D.; Loz, W.; Weisbrod, G.,
Brennst.-Chem., 1959, 40, 279. [all data]
Kusmierz, Malinski, et al., 1985
Kusmierz, J.; Malinski, E.; Czerwiec, W.; Szafranek, J.,
Kováts retention indices of high-molecular-weight monomethyl-, cyclopentyl-, cyclohexyl- and phenylalkanes,
J. Chromatogr., 1985, 331, 219-228, https://doi.org/10.1016/0021-9673(85)80027-3
. [all data]
Khorasheh, Gray, et al., 1989
Khorasheh, F.; Gray, M.R.; Selucky, M.L.,
Correlation for Kováts retention index of C9-C26 monoalkyl and polymethyl alkanes and alkenes,
J. Chromatogr., 1989, 481, 1-16, https://doi.org/10.1016/S0021-9673(01)96747-0
. [all data]
Zaikin and Borisov, 2002
Zaikin, V.G.; Borisov, R.S.,
Chromatographic-mass spectrometric analysis of Fishcer-Tropsch synthesis products,
J. Anal. Chem. USSR (Engl. Transl.), 2002, 57, 6, 544-551. [all data]
Romeo, Ziino, et al., 2007
Romeo, V.; Ziino, M.; Giuffrrida, D.; Condurso, C.; Verzera, A.,
Flavour profile of capers (Capparis spinosa L.) from the Eolian Archipelago by HS-SPME/GC?MS,
Food Chem., 2007, 101, 3, 1272-1278, https://doi.org/10.1016/j.foodchem.2005.12.029
. [all data]
Krkosova, Kubinec, et al., 2007
Krkosova, Z.; Kubinec, R.; Addova, G.; Jurdakova, H.; Blasko, J.; Ostrovsky, I.; Sojak, L.,
Gas chromatographic - mass spectrometric characterization of monomethylalkanes from fuel diesel,
Petroleum Coal, 2007, 49, 3, 51-62. [all data]