2-Pentanone, 4-methyl-, oxime
- Formula: C6H13NO
- Molecular weight: 115.1735
- IUPAC Standard InChIKey: ZKALVNREMFLWAN-UHFFFAOYSA-N
- CAS Registry Number: 105-44-2
- Chemical structure:
View 3d structure (requires JavaScript / HTML 5) - Other names: Methyl isobutyl ketoxime; 2-Methyl-4-pentanone oxime; 4-Methyl-2-pentanone oxime; USAF am-4; 4-methylpentan-2-one oxime

Normal alkane RI, non-polar column, temperature ramp

Column type | Active phase | I | Reference | Comment |
---|---|---|---|---|
Capillary | OV-101 | 946. | Zenkevich, 2005 | 25. m/0.20 mm/0.10 μm, N2/He, 6. K/min; Tstart: 50. C; Tend: 250. C |

References

Zenkevich, 2005
Zenkevich, I.G.,
Experimentally measured retention indices., 2005. [all data]