p-Octylacetophenone
- Formula: C16H24O
- Molecular weight: 232.3612
- IUPAC Standard InChIKey: GARQDIVXKVBJFP-UHFFFAOYSA-N
- CAS Registry Number: 10541-56-7
- Chemical structure:
View 3d structure (requires JavaScript / HTML 5) - Species with the same structure:
- Other names: 4-n-Octylacetophenone; p-n-Octylacetophenone; Acetophenone, 4'-octyl-; Ethanone, 1-(4-octylphenyl)-; 4'-Octylacetophenone

Phase change data

Data compiled by: Robert L. Brown and Stephen E. Stein
Reduced pressure boiling point
Tboil (K) | Pressure (bar) | Reference |
---|---|---|
425. to 426. | 0.001 | Frinton Laboratories Inc., 1986 |

References

Frinton Laboratories Inc., 1986
Frinton Laboratories Inc.,
Catalog Number 11, Frinton Laboratories Inc., Vineland, NJ, 1986, 99. [all data]
Lang (editor), 1971
Lang (editor), L.,
Absorption Spectra in the Ultraviolet and Visible Region, 1971, 15, 51. [all data]