2,5-Dimethoxycinnamic acid
- Formula: C11H12O4
- Molecular weight: 208.2106
- IUPAC Standard InChIKey: JPQWWJZORKTMIZ-ZZXKWVIFSA-N
- CAS Registry Number: 10538-51-9
- Chemical structure:
View 3d structure (requires JavaScript / HTML 5) - Other names: 2-Propenoic acid, 3-(2,5-dimethoxyphenyl)-; 3-(2,5-Dimethoxyphenyl)-2-propenoic acid; 2',5'-dimethoxycinnamic acid; trans-2,5-dimethoxycinnamic acid

Phase change data

Data compiled by: William E. Acree, Jr., James S. Chickos
Quantity | Value | Units | Method | Reference | Comment |
---|---|---|---|---|---|
ΔsubH° | 138.8 ± 1.1 | kJ/mol | ME | Monte and Hillesheim, 1999 | Based on data from 376. to 391. K. |

References

Monte and Hillesheim, 1999
Monte, Manuel J.S.; Hillesheim, Dorothea M.,
Vapour pressures, enthalpies and entropies of sublimation of trans -cinnamic acid and of nine methoxy and dimethoxycinnamic acids,
The Journal of Chemical Thermodynamics, 1999, 31, 11, 1443-1456, https://doi.org/10.1006/jcht.1999.0540
. [all data]