3-Methylene-6-dichloromethyl-6-methyl-1,4-cyclohexadiene
- Formula: C9H10Cl2
- Molecular weight: 189.082
- IUPAC Standard InChIKey: IQKLGVKFSMIJGF-UHFFFAOYSA-N
- CAS Registry Number: 105364-15-6
- Chemical structure:
View 3d structure (requires JavaScript / HTML 5) - Permanent link for this species. Use this link for bookmarking this species for future reference.

Condensed phase thermochemistry data

Data compiled by: Hussein Y. Afeefy, Joel F. Liebman, and Stephen E. Stein
Quantity | Value | Units | Method | Reference | Comment |
---|---|---|---|---|---|
ΔcH°solid | -4939.84 | kJ/mol | Ccb | Auwers, 1907 |

References

Auwers, 1907
Auwers, K.,
Mittheilungen aus dem chemischen Institut der Universitat Greifswald. I. Ueber Alkylidendihydrobenzolderivate,
Ann. Chem., 1907, 352, 219-272. [all data]