2-Chloro-N-ethylacetamide
- Formula: C4H8ClNO
- Molecular weight: 121.565
- IUPAC Standard InChIKey: JUBORNFANZZVJL-UHFFFAOYSA-N
- CAS Registry Number: 105-35-1
- Chemical structure:
View 3d structure (requires JavaScript / HTML 5) - Other names: N-Ethylchloroacetamide; (N-Chloroacetyl)ethyl amine; Acetamide, 2-chloro-N-ethyl-

Phase change data

Data compiled by: Robert L. Brown and Stephen E. Stein
Reduced pressure boiling point
Tboil (K) | Pressure (bar) | Reference |
---|---|---|
376. to 378. | 0.027 | Frinton Laboratories Inc., 1986 |

References

Frinton Laboratories Inc., 1986
Frinton Laboratories Inc.,
Catalog Number 11, Frinton Laboratories Inc., Vineland, NJ, 1986, 99. [all data]