1-Hexyn-3-ol
- Formula: C6H10O
- Molecular weight: 98.1430
- IUPAC Standard InChIKey: LTFTWJYRQNTCHI-UHFFFAOYSA-N
- CAS Registry Number: 105-31-7
- Chemical structure:
View 3d structure (requires JavaScript / HTML 5) - Other names: Propylethinylcarbinol; 1-Hexyne-3-ol; 1-Propylpropargyl alcohol; 3-Hydroxy-1-hexyne; Hexynol; hex-1-yn-3-ol

Phase change data

Data compiled by: Robert L. Brown and Stephen E. Stein
Quantity | Value | Units | Method | Reference | Comment |
---|---|---|---|---|---|
Tboil | 415. to 416. | K | N/A | Farchan Laboratories, 1990 |

References

Farchan Laboratories, 1990
Farchan Laboratories,
Research Chemicals Catalog, Farchan Laboratories, Gainesville, FL, 1990, 91. [all data]