1-Pentanol, 2-methyl-
- Formula: C6H14O
- Molecular weight: 102.1748
- IUPAC Standard InChIKey: PFNHSEQQEPMLNI-UHFFFAOYSA-N
- CAS Registry Number: 105-30-6
- Chemical structure:
View 3d structure (requires JavaScript / HTML 5) - Other names: 2-Methyl-1-pentanol; Isohexyl alcohol; 2-Methylpentanol-1; M.I.B.C.; 2-Methyl-2-propylethanol; 2-Methylpentanol; Methyl-2 pentanol-1; 2-methylpentan-1-ol

Condensed phase thermochemistry data

Data compiled by: Eugene S. Domalski and Elizabeth D. Hearing
Constant pressure heat capacity of liquid
Cp,liquid (J/mol*K) | Temperature (K) | Reference |
---|---|---|
249.21 | 298.15 | Benson, D'Arcy, et al., 1985 |
247.63 | 298.15 | Bravo, Pintos, et al., 1984 |
248.40 | 298.15 | Aicart, Kumaran, et al., 1983 |

Phase change data

Data compiled as indicated in comments:
BS - Robert L. Brown and Stephen E. Stein
TRC - Thermodynamics Research Center, NIST Boulder Laboratories, Chris Muzny director
AC - William E. Acree, Jr., James S. Chickos
Quantity | Value | Units | Method | Reference | Comment |
---|---|---|---|---|---|
Tboil | 421. ± 2. | K | AVG | N/A | Average of 20 out of 21 values; Individual data points |
Quantity | Value | Units | Method | Reference | Comment |
Tc | 604.4 ± 0.5 | K | N/A | Gude and Teja, 1995 | |
Tc | 604.4 | K | N/A | Quadri, Khilar, et al., 1991 | Uncertainty assigned by TRC = 0.7 K; TRC |
Quantity | Value | Units | Method | Reference | Comment |
Pc | 34.5 ± 0.2 | bar | N/A | Gude and Teja, 1995 | |
Pc | 34.50 | bar | N/A | Quadri, Khilar, et al., 1991 | Uncertainty assigned by TRC = 0.50 bar; TRC |
Quantity | Value | Units | Method | Reference | Comment |
ΔvapH° | 59.4 ± 0.3 | kJ/mol | GS | Kulikov, Verevkin, et al., 2001 | Based on data from 275. to 313. K.; AC |
Enthalpy of vaporization
ΔvapH (kJ/mol) | Temperature (K) | Method | Reference | Comment |
---|---|---|---|---|
49.3 | 382. | A | Stephenson and Malanowski, 1987 | Based on data from 367. to 423. K.; AC |
64.9 | 279. | A | Stephenson and Malanowski, 1987 | Based on data from 261. to 294. K. See also Thomas, Meatyard, et al., 1979.; AC |
57.4 ± 0.2 | 328. | C | Majer, Svoboda, et al., 1985 | AC |
55.7 ± 0.2 | 343. | C | Majer, Svoboda, et al., 1985 | AC |
53.9 ± 0.2 | 358. | C | Majer, Svoboda, et al., 1985 | AC |
52.7 ± 0.2 | 368. | C | Majer, Svoboda, et al., 1985 | AC |
54.2 | 313. | N/A | Wilhoit and Zwolinski, 1973 | Based on data from 298. to 423. K.; AC |
50.2 | 356. | I | Hovorka, Lankelma, et al., 1938 | Based on data from 298. to 413. K.; AC |
Antoine Equation Parameters
log10(P) = A − (B / (T + C))
P = vapor pressure (bar)
T = temperature (K)
View plot Requires a JavaScript / HTML 5 canvas capable browser.
Temperature (K) | A | B | C | Reference | Comment |
---|---|---|---|---|---|
298. to 423. | 6.198 | 2625.143 | 3.181 | Hovorka, Lankelma, et al., 1938 | Coefficents calculated by NIST from author's data. |

Normal alkane RI, non-polar column, custom temperature program

Data compiled by: NIST Mass Spectrometry Data Center, William E. Wallace, director

Column type CapillaryCapillaryCapillaryCapillaryCapillary
Active phase HP-5HP-5SPB-1Methyl SiliconeMethyl Silicone
Column length (m) 30.30.30.
Carrier gas   He
Substrate
Column diameter (mm) 0.250.250.25
Phase thickness (μm) 0.250.250.25
Program 40 0C (2 min) 5 0C/min -> 80 0C 7 oC/min -> 160 0C 9 0C/min -> 200 0C 20 0C/min -> 280 0C (10 min)not specified40C(10min) => 2C/min => 200C(1min) => 2C/min => 250C (10min)not specifiednot specified
I 824.818.837.824.818.
ReferenceZhao, Li, et al., 2008Zhao, Li, et al., 2008Bosch-Fuste, Riu-Aumatell, et al., 2007Chen and Feng, 2007Feng and Mu, 2007
Comment MSDC-RI MSDC-RI MSDC-RI MSDC-RI MSDC-RI
Column type CapillaryCapillaryCapillaryCapillaryCapillary
Active phase HP-5Methyl SiliconeMethyl SiliconeSE-30Polydimethyl siloxane
Column length (m)
Carrier gas He
Substrate
Column diameter (mm)
Phase thickness (μm)
Program 50C => 3C/min => 200C(10min) => 10C/min => 290C(10min)not specifiednot specifiednot specifiednot specified
I 836.824.824.837.813.
ReferenceSplivallo, Bossi, et al., 2007Kou, Zhang, et al., 2006Fu and Wang, 2004Vinogradov, 2004Junkes, Castanho, et al., 2003
Comment MSDC-RI MSDC-RI MSDC-RI MSDC-RI MSDC-RI
Column type Capillary
Active phase Methyl Silicone
Column length (m)
Carrier gas
Substrate
Column diameter (mm)
Phase thickness (μm)
Program not specified
I 818.
ReferenceEstrada and Gutierrez, 1999
Comment MSDC-RI

Kovats' RI, non-polar column, isothermal

Data compiled by: NIST Mass Spectrometry Data Center, William E. Wallace, director

Column type CapillaryCapillaryPackedPackedPacked
Active phase OV-101OV-101SE-30Apiezon LApiezon L
Column length (m) 100.100.3.7
Carrier gas N2N2
Substrate   Celatom AW silanizedCelite 545Celite 545
Column diameter (mm) 0.270.27
Phase thickness (μm)
Temperature (C) 80.90.150.120.160.
I 836.2837.5820.798.803.
ReferenceBoneva, 1987Boneva, 1987Haken, Nguyen, et al., 1979Bogoslovsky, Anvaer, et al., 1978Bogoslovsky, Anvaer, et al., 1978
Comment MSDC-RI MSDC-RI MSDC-RI MSDC-RI MSDC-RI
Column type PackedPackedPacked
Active phase SE-30SE-30SE-30
Column length (m) 1.1.1.
Carrier gas ArArAr
Substrate Chromosorb W AW DMCS HP (80-100 mesh)Chromosorb W AW DMCS HP (80-100 mesh)Chromosorb W AW DMCS HP (80-100 mesh)
Column diameter (mm)
Phase thickness (μm)
Temperature (C) 100.120.140.
I 824.822.820.
ReferencePías and Gascó, 1975Pías and Gascó, 1975Pías and Gascó, 1975
Comment MSDC-RI MSDC-RI MSDC-RI

Normal alkane RI, non-polar column, temperature ramp

Data compiled by: NIST Mass Spectrometry Data Center, William E. Wallace, director

Column type CapillaryCapillaryPacked
Active phase HP-5OV-101Apiezon L
Column length (m) 60.50.2.
Carrier gas He
Substrate   Chromosorb G-AW-DMCS
Column diameter (mm) 0.320.28
Phase thickness (μm) 0.25
Tstart (C) 30.80.25.
Tend (C) 260.200.
Heat rate (K/min) 2.2.10.
Initial hold (min) 2.
Final hold (min) 28.
I 843.0837.846.
ReferenceLeffingwell and Alford, 2005Anker, Jurs, et al., 1990Dahlmann, Köser, et al., 1979
Comment MSDC-RI MSDC-RI MSDC-RI

Gas phase ion energetics data

Data compiled by: John E. Bartmess

De-protonation reactions

C6H13O- + Hydrogen cation = 1-Pentanol, 2-methyl-

By formula: C6H13O- + H+ = C6H14O

Quantity Value Units Method Reference Comment
Δr373.1 ± 2.0kcal/molCIDCHaas and Harrison, 1993gas phase; Both metastable and 50 eV collision energy.
Quantity Value Units Method Reference Comment
Δr366.5 ± 2.1kcal/molH-TSHaas and Harrison, 1993gas phase; Both metastable and 50 eV collision energy.

Lee's RI, non-polar column, temperature ramp

Data compiled by: NIST Mass Spectrometry Data Center, William E. Wallace, director

Column type Capillary
Active phase DB-5
Column length (m) 30.
Carrier gas He
Substrate
Column diameter (mm) 0.26
Phase thickness (μm) 0.25
Tstart (C) 50.
Tend (C) 300.
Heat rate (K/min) 6.
Initial hold (min) 4.
Final hold (min) 20.
I 132.61
ReferenceRostad and Pereira, 1986
Comment MSDC-RI

Normal alkane RI, polar column, temperature ramp

Data compiled by: NIST Mass Spectrometry Data Center, William E. Wallace, director

Column type Capillary
Active phase Carbowax 20M
Column length (m) 80.
Carrier gas
Substrate
Column diameter (mm) 0.2
Phase thickness (μm)
Tstart (C) 70.
Tend (C) 170.
Heat rate (K/min) 2.
Initial hold (min)
Final hold (min)
I 1268.
ReferenceAnker, Jurs, et al., 1990
Comment MSDC-RI

References

Benson, D'Arcy, et al., 1985
Benson, G.C.; D'Arcy, P.J.; Kumaran, M.K.,
Excess molar isobaric heat capacities of (2-methylpentan-1-ol + n-hexane) and (2-ethylbutan-1-ol + n-hexane) at 298.15 K,
J. Chem. Thermodynam., 1985, 17, 501-504. [all data]
Bravo, Pintos, et al., 1984
Bravo, R.; Pintos, M.; Baluja, M.C.; Paz Andrade, M.I.; Roux-Desgranges, G.; Grolier, J.-P.E.,
Excess volumes excess heat capacities of some mixtures: (an isomer of hexanol + an n-alkane) at 298.15 K,
J. Chem. Thermodynam., 1984, 16, 73-79. [all data]
Aicart, Kumaran, et al., 1983
Aicart, E.; Kumaran, M.K.; Halpin, C.J.; Benson, G.C.,
Ultrasonic speeds and isentropic compressibilities of 2-methylpentan-1-ol with hexane isomers at 298.15 K,
J. Chem. Thermodynam., 1983, 15, 1189-1197. [all data]
Gude and Teja, 1995
Gude, M.; Teja, A.S.,
Vapor-Liquid Critical Properties of Elements and Compounds. 4. Aliphatic Alkanols,
J. Chem. Eng. Data, 1995, 40, 1025-1036. [all data]
Quadri, Khilar, et al., 1991
Quadri, S.K.; Khilar, K.C.; Kudchadker, A.P.; Patni, M.J.,
Measurement of the critical temperatures and critical pressures of some thermally stable or mildly unstable alkanols,
J. Chem. Thermodyn., 1991, 23, 67-76. [all data]
Kulikov, Verevkin, et al., 2001
Kulikov, Dmitry; Verevkin, Sergey P.; Heintz, Andreas,
Determination of Vapor Pressures and Vaporization Enthalpies of the Aliphatic Branched C 5 and C 6 Alcohols,
J. Chem. Eng. Data, 2001, 46, 6, 1593-1600, https://doi.org/10.1021/je010187p
. [all data]
Stephenson and Malanowski, 1987
Stephenson, Richard M.; Malanowski, Stanislaw,
Handbook of the Thermodynamics of Organic Compounds, 1987, https://doi.org/10.1007/978-94-009-3173-2
. [all data]
Thomas, Meatyard, et al., 1979
Thomas, Leo H.; Meatyard, Robert; Smith, Harry; Davies, Gwyn H.,
Vapor pressures and molar entropies of vaporization of monohydric alcohols,
J. Chem. Eng. Data, 1979, 24, 3, 159-161, https://doi.org/10.1021/je60082a032
. [all data]
Majer, Svoboda, et al., 1985
Majer, V.; Svoboda, V.; Lencka, M.,
Enthalpies of vaporization and cohesive energies of dimethylpyridines and trimethylpyridines,
The Journal of Chemical Thermodynamics, 1985, 17, 4, 365-370, https://doi.org/10.1016/0021-9614(85)90133-8
. [all data]
Wilhoit and Zwolinski, 1973
Wilhoit, R.C.; Zwolinski, B.J.,
Physical and thermodynamic properties of aliphatic alcohols,
J. Phys. Chem. Ref. Data Suppl., 1973, 1, 2, 1. [all data]
Hovorka, Lankelma, et al., 1938
Hovorka, Frank; Lankelma, Herman P.; Stanford, Spencer C.,
Thermodynamic Properties of the Hexyl Alcohols. II. Hexanols-1, -2, -3 and 2-Methylpentanol-1 and -4,
J. Am. Chem. Soc., 1938, 60, 4, 820-827, https://doi.org/10.1021/ja01271a018
. [all data]