1-icosanamine
- Formula: C20H43N
- Molecular weight: 297.5621
- IUPAC Standard InChIKey: BUHXFUSLEBPCEB-UHFFFAOYSA-N
- CAS Registry Number: 10525-37-8
- Chemical structure:
View 3d structure (requires JavaScript / HTML 5) - Permanent link for this species. Use this link for bookmarking this species for future reference.

Phase change data

Data compiled by: Thermodynamics Research Center, NIST Boulder Laboratories, Chris Muzny director
Quantity | Value | Units | Method | Reference | Comment |
---|---|---|---|---|---|
Tfus | 331.7 | K | N/A | Shulman, Formo, et al., 1961 | Uncertainty assigned by TRC = 3. K |
Tfus | 330.95 | K | N/A | Zvejnieks, 1954 | Uncertainty assigned by TRC = 0.5 K |

References

Shulman, Formo, et al., 1961
Shulman, S.; Formo, M.W.; Rheineck, A.E.,
Aliphatic Urethanes. Effect of Chain Length on Some Physical Properties,
J. Am. Oil Chem. SOc., 1961, 38, 205-8. [all data]
Zvejnieks, 1954
Zvejnieks, A.,
Preparation and Properties of Some Pure Fatty and Rosin Amines.,
Sven. Kem. Tidskr., 1954, 66, 316. [all data]