1-Butene, 4-chloro-3-methyl-
- Formula: C5H9Cl
- Molecular weight: 104.578
- IUPAC Standard InChIKey: ZFXHRKNMXMGZNU-UHFFFAOYSA-N
- CAS Registry Number: 10524-01-3
- Chemical structure:
View 3d structure (requires JavaScript / HTML 5) - Other names: 4-Chloro-3-methyl-1-butene

Normal alkane RI, non-polar column, isothermal

Column type | Active phase | Temperature (C) | I | Reference | Comment |
---|---|---|---|---|---|
Capillary | Squalane | 30. | 664. | Tourres, 1968 | Nitrogen; Column length: 50. m; Column diameter: 0.25 mm |
Capillary | Squalane | 50. | 667. | Tourres, 1968 | Nitrogen; Column length: 50. m; Column diameter: 0.25 mm |

References

Tourres, 1968
Tourres, D.A.,
Separation of mono- and dichloro-methyl butanes and of monochloro-methyl butenes by preparative gas chromatography,
Chromatographia, 1968, 1, 11-12, 437-442, https://doi.org/10.1007/BF02255759
. [all data]