Betazole
- Formula: C5H9N3
- Molecular weight: 111.1451
- IUPAC Standard InChIKey: JXDFEQONERDKSS-UHFFFAOYSA-N
- CAS Registry Number: 105-20-4
- Chemical structure:
View 3d structure (requires JavaScript / HTML 5) - Other names: 1H-Pyrazole-3-ethanamine; Pyrazole, 3-(2-aminoethyl)-; Ametazole; 3-(2-Aminoethyl)pyrazole; 3-Aminoethylpyrazole

Phase change data

Data compiled by: Robert L. Brown and Stephen E. Stein
Reduced pressure boiling point
Tboil (K) | Pressure (bar) | Reference |
---|---|---|
391. to 396. | 0.0007 | Buckingham and Donaghy, 1982 |

Normal alkane RI, non-polar column, custom temperature program

Column type | Active phase | I | Reference | Comment |
---|---|---|---|---|
Other | Methyl Silicone | 1390. | Ardrey and Moffat, 1981 | Program: not specified |

References

Buckingham and Donaghy, 1982
Buckingham, J.; Donaghy, S.M.,
Dictionary of Organic Compounds: Fifth Edition, Chapman and Hall, New York, 1982, 1. [all data]
Ardrey and Moffat, 1981
Ardrey, R.E.; Moffat, A.C.,
Gas-liquid chromatographic retention indices of 1318 substances of toxicological interest on SE-30 or OV-1 stationary phase,
J. Chromatogr., 1981, 220, 3, 195-252, https://doi.org/10.1016/S0021-9673(00)81925-1
. [all data]