2-Propenoic acid, 2-methyl-, 2-(diethylamino)ethyl ester
- Formula: C10H19NO2
- Molecular weight: 185.2634
- IUPAC Standard InChIKey: SJIXRGNQPBQWMK-UHFFFAOYSA-N
- CAS Registry Number: 105-16-8
- Chemical structure:
View 3d structure (requires JavaScript / HTML 5) - Other names: Methacrylic acid, 2-(diethylamino)ethyl ester; β-(Diethylamino)ethyl methacrylate; β-(N,N-Diethylamino)ethyl methacrylate; Daktose B; Diethylaminoethyl methacrylate; Ethanol, 2-(diethylamino)-, methacrylate (ester); N,N-Diethylaminoethyl methacrylate; 2-(N,N-Diethylamino)ethyl methacrylate; 2-Diethylaminoethyl methacrylate; 2-Diethylaminoethylester kyseliny methakrylove; NSC 14490

Phase change data

Data compiled as indicated in comments:
TRC - Thermodynamics Research Center, NIST Boulder Laboratories, Chris Muzny director
DH - Eugene S. Domalski and Elizabeth D. Hearing
Quantity | Value | Units | Method | Reference | Comment |
---|---|---|---|---|---|
Tfus | 207.5 | K | N/A | Karabaev, Abduzhaminov, et al., 1985 | Uncertainty assigned by TRC = 0.1 K; TRC |
Enthalpy of fusion
ΔfusH (kJ/mol) | Temperature (K) | Reference | Comment |
---|---|---|---|
13.080 | 207.5 | Karabaev, Abduzhaminov, et al., 1985, 2 | DH |
Entropy of fusion
ΔfusS (J/mol*K) | Temperature (K) | Reference | Comment |
---|---|---|---|
63.04 | 207.5 | Karabaev, Abduzhaminov, et al., 1985, 2 | DH |

References

Karabaev, Abduzhaminov, et al., 1985
Karabaev, M.K.; Abduzhaminov, T.P.; Kenisarin, M.M.; Saidov, A.A.,
Thermodynamics of the crystal-liquid phase transition in acrylates and methacrylates.,
Izv. Akad. Nauk Uzb. SSR Ser., Fiz-Mat. Nauk, 1985, 1985, No. 5, 74-7. [all data]
Karabaev, Abduzhaminov, et al., 1985, 2
Karabaev, M.K.; Abduzhaminov, T.P.; Kenisarin, M.M.; Saidov, A.A.,
Thermodynamics of the crystal-liquid phase transition in acrylates and methacrylates, Izv. Akad. Nauk Uzb. SSR,
Ser. Fiz.-Mat. Nauk, 1985, (5), 74-77. [all data]