1,4-Benzenedimethanethiol
- Formula: C8H10S2
- Molecular weight: 170.295
- IUPAC Standard InChIKey: IYPNRTQAOXLCQW-UHFFFAOYSA-N
- CAS Registry Number: 105-09-9
- Chemical structure:
View 3d structure (requires JavaScript / HTML 5) - Other names: α,α'-p-Xylenedithiol; p-Xylene-α,α'-dithiol; p-Xylylenedithiol; 1,4-Benzenebis(methanethiol); 1,4-Bis(mercaptomethyl)benzene; 4-(Sulfanylmethyl)benzyl hydrosulfide

Phase change data

Data compiled by: Robert L. Brown and Stephen E. Stein
Quantity | Value | Units | Method | Reference | Comment |
---|---|---|---|---|---|
Tfus | 319. to 320. | K | N/A | Buckingham and Donaghy, 1982 |
Reduced pressure boiling point
Tboil (K) | Pressure (bar) | Reference |
---|---|---|
429. | 0.016 | Buckingham and Donaghy, 1982 |

Van Den Dool and Kratz RI, non-polar column, custom temperature program

Column type | Active phase | I | Reference | Comment |
---|---|---|---|---|
Capillary | VF-5MS | 1578.8 | Tret'yakov, 2008 | 30. m/0.25 mm/0.25 μm, He; Program: Multi-step temperature program; T(initial)=60C; T(final)=270C |

References

Buckingham and Donaghy, 1982
Buckingham, J.; Donaghy, S.M.,
Dictionary of Organic Compounds: Fifth Edition, Chapman and Hall, New York, 1982, 1. [all data]
Tret'yakov, 2008
Tret'yakov, K.V.,
Retention Data. NIST Mass Spectrometry Data Center., NIST Mass Spectrometry Data Center, 2008. [all data]