di-tert-pentyl peroxide
- Formula: C10H22O2
- Molecular weight: 174.2805
- IUPAC Standard InChIKey: JJRDRFZYKKFYMO-UHFFFAOYSA-N
- CAS Registry Number: 10508-09-5
- Chemical structure:
View 3d structure (requires JavaScript / HTML 5) - Other names: (CH3)2C(C2H5)OOC(CH3)2C2H5

Condensed phase thermochemistry data

Data compiled by: Hussein Y. Afeefy, Joel F. Liebman, and Stephen E. Stein
Quantity | Value | Units | Method | Reference | Comment |
---|---|---|---|---|---|
ΔfH°liquid | -599.6 | kJ/mol | Ccb | Islam, 1980 | |
Quantity | Value | Units | Method | Reference | Comment |
ΔcH°liquid | -6479.8 | kJ/mol | Ccb | Islam, 1980 | Corresponding ΔfHºliquid = -599.6 kJ/mol (simple calculation by NIST; no Washburn corrections) |

Phase change data

Data compiled by: Robert L. Brown and Stephen E. Stein
Reduced pressure boiling point
Tboil (K) | Pressure (bar) | Reference |
---|---|---|
331.7 | 0.019 | Weast and Grasselli, 1989 |
331.6 | 0.019 | Buckingham and Donaghy, 1982 |

References

Islam, 1980
Islam, T.S.A.,
Heats of combustion of di-tert-butyl and di-tert-amyl peroxides and their RO-OR bond dissociation energies,
Dacca Univ. Stud., Part B, 1980, 28, 1-4. [all data]
Weast and Grasselli, 1989
CRC Handbook of Data on Organic Compounds, 2nd Editon, Weast,R.C and Grasselli, J.G., ed(s)., CRC Press, Inc., Boca Raton, FL, 1989, 1. [all data]
Buckingham and Donaghy, 1982
Buckingham, J.; Donaghy, S.M.,
Dictionary of Organic Compounds: Fifth Edition, Chapman and Hall, New York, 1982, 1. [all data]