2,2',5,5'-Tetramethyl-1,1'-bipyrrole
- Formula: C12H16N2
- Molecular weight: 188.2688
- IUPAC Standard InChIKey: PANKTSHEKUXUFL-UHFFFAOYSA-N
- CAS Registry Number: 10507-71-8
- Chemical structure:
View 3d structure (requires JavaScript / HTML 5) - Permanent link for this species. Use this link for bookmarking this species for future reference.

Condensed phase thermochemistry data

Data compiled by: Hussein Y. Afeefy, Joel F. Liebman, and Stephen E. Stein
Quantity | Value | Units | Method | Reference | Comment |
---|---|---|---|---|---|
ΔfH°solid | 132.2 ± 1.0 | kJ/mol | Ccb | Coleman and Skinner, 1966 | |
Quantity | Value | Units | Method | Reference | Comment |
ΔcH°solid | -7141.0 ± 0.8 | kJ/mol | Ccb | Coleman and Skinner, 1966 |

References

Coleman and Skinner, 1966
Coleman, D.J.; Skinner, H.A.,
Heats of combustion of organic compounds of nitrogen. Part 4.- Succinimide, N,N'-bisuccinimide and 2,5,2',5'-tetramethyl-dipyrryl-(1,1'),
Trans. Faraday Soc., 1966, 62, 2057-2062. [all data]