Cyclohexane, 1,2-dichloro-, cis-
- Formula: C6H10Cl2
- Molecular weight: 153.050
- IUPAC Standard InChIKey: GZEZIBFVJYNETN-OLQVQODUSA-N
- CAS Registry Number: 10498-35-8
- Chemical structure:
View 3d structure (requires JavaScript / HTML 5) - Stereoisomers:
- Other names: cis-1,2-Dichlorocyclohexane; 1,2-Dichlorocyclohexane, (Z)-

Phase change data

Data compiled as indicated in comments:
BS - Robert L. Brown and Stephen E. Stein
TRC - Thermodynamics Research Center, NIST Boulder Laboratories, Chris Muzny director
AC - William E. Acree, Jr., James S. Chickos
Quantity | Value | Units | Method | Reference | Comment |
---|---|---|---|---|---|
Tboil | 480.1 | K | N/A | Weast and Grasselli, 1989 | BS |
Quantity | Value | Units | Method | Reference | Comment |
Tfus | 268. | K | N/A | Stevens and Grummitt, 1952 | Uncertainty assigned by TRC = 3. K; TRC |
Reduced pressure boiling point
Tboil (K) | Pressure (bar) | Reference | Comment |
---|---|---|---|
364.2 | 0.027 | Weast and Grasselli, 1989 | BS |
348. to 349. | 0.005 | Frinton Laboratories Inc., 1986 | BS |
Enthalpy of vaporization
ΔvapH (kJ/mol) | Temperature (K) | Method | Reference | Comment |
---|---|---|---|---|
45.8 | 379. | A | Stephenson and Malanowski, 1987 | Based on data from 364. to 480. K.; AC |

Normal alkane RI, non-polar column, temperature ramp

Column type | Active phase | I | Reference | Comment |
---|---|---|---|---|
Capillary | OV-101 | 1092. | Zenkevich, Eliseenkov, et al., 2009 | 25. m/0.20 mm/0.25 μm, Nitrogen, 6. K/min; Tstart: 60. C; Tend: 240. C |
Capillary | OV-101 | 1092. | Zenkevich, Eliseenkov, et al., 2009 | 25. m/0.20 mm/0.25 μm, Nitrogen, 6. K/min; Tstart: 60. C; Tend: 240. C |
Capillary | OV-101 | 1094. | Zenkevich, Eliseenkov, et al., 2009 | 25. m/0.20 mm/0.25 μm, Nitrogen, 6. K/min; Tstart: 60. C; Tend: 240. C |

References

Weast and Grasselli, 1989
CRC Handbook of Data on Organic Compounds, 2nd Editon, Weast,R.C and Grasselli, J.G., ed(s)., CRC Press, Inc., Boca Raton, FL, 1989, 1. [all data]
Stevens and Grummitt, 1952
Stevens, H.C.; Grummitt, O.,
The Stereochemitry of te Reactions of cis- and trans-2-Chlorocyclohexanol with Thionyl Chloride,
J. Am. Chem. Soc., 1952, 74, 4876-9. [all data]
Frinton Laboratories Inc., 1986
Frinton Laboratories Inc.,
Catalog Number 11, Frinton Laboratories Inc., Vineland, NJ, 1986, 99. [all data]
Stephenson and Malanowski, 1987
Stephenson, Richard M.; Malanowski, Stanislaw,
Handbook of the Thermodynamics of Organic Compounds, 1987, https://doi.org/10.1007/978-94-009-3173-2
. [all data]
Zenkevich, Eliseenkov, et al., 2009
Zenkevich, I.G.; Eliseenkov, E.V.; Kasatochkin, A.N.,
Chromatographic Identification of Cyclohexane Chlorination Products by an Additive Scheme for the Prediction of Retention Indices,
Chromatographia, 2009, 70, 5/6, 839-849, https://doi.org/10.1365/s10337-009-1213-x
. [all data]