Phenol, 4-nitroso-
- Formula: C6H5NO2
- Molecular weight: 123.1094
- IUPAC Standard InChIKey: JSTCPNFNKICNNO-UHFFFAOYSA-N
- CAS Registry Number: 104-91-6
- Chemical structure:
View 3d structure (requires JavaScript / HTML 5) - Other names: Phenol, p-nitroso-; p-Nitrosophenol; Nitrosophenol; 4-Nitrosophenol; Quinone monoxime; p-Chinonmonoxim; 4-Nitrosofenol; Benzoquinone monooxime; NSC 3124

Reaction thermochemistry data

Data compiled by: John E. Bartmess
Individual Reactions
C6H4NO2- + =
By formula: C6H4NO2- + H+ = C6H5NO2
Quantity | Value | Units | Method | Reference | Comment |
---|---|---|---|---|---|
ΔrH° | 1376. ± 8.8 | kJ/mol | G+TS | Taft and Topsom, 1987 | gas phase; value altered from reference due to change in acidity scale |
Quantity | Value | Units | Method | Reference | Comment |
ΔrG° | 1345. ± 8.4 | kJ/mol | IMRE | Taft and Topsom, 1987 | gas phase; value altered from reference due to change in acidity scale |

Gas phase ion energetics data

Data compiled by: John E. Bartmess
De-protonation reactions
C6H4NO2- + =
By formula: C6H4NO2- + H+ = C6H5NO2
Quantity | Value | Units | Method | Reference | Comment |
---|---|---|---|---|---|
ΔrH° | 1376. ± 8.8 | kJ/mol | G+TS | Taft and Topsom, 1987 | gas phase; value altered from reference due to change in acidity scale |
Quantity | Value | Units | Method | Reference | Comment |
ΔrG° | 1345. ± 8.4 | kJ/mol | IMRE | Taft and Topsom, 1987 | gas phase; value altered from reference due to change in acidity scale |

References

Taft and Topsom, 1987
Taft, R.W.; Topsom, R.D.,
The Nature and Analysis of Substituent Effects,
Prog. Phys. Org. Chem., 1987, 16, 1. [all data]